niobium
- Formula: Nb
- Molecular weight: 92.90638
- IUPAC Standard InChIKey: GUCVJGMIXFAOAE-UHFFFAOYSA-N
- CAS Registry Number: 7440-03-1
- Chemical structure:
- NIST Atomic Spectra Database - Lines Holdings (on physics web site)
- NIST Atomic Spectra Database - Levels Holdings (on physics web site)
- NIST Atomic Spectra Database - Ground states and ionization energies (on physics web site)
- Gas Phase Kinetics Database
- X-ray Photoelectron Spectroscopy Database, version 5.0

Condensed phase thermochemistry data

Quantity | Value | Units | Method | Reference | Comment |
---|---|---|---|---|---|
ΔfH°liquid | 29.65 | kJ/mol | Review | Chase, 1998 | Data last reviewed in December, 1973 |
Quantity | Value | Units | Method | Reference | Comment |
S°liquid,1 bar | 47.30 | J/mol*K | Review | Chase, 1998 | Data last reviewed in December, 1973 |
Quantity | Value | Units | Method | Reference | Comment |
S°solid | 36.47 | J/mol*K | Review | Chase, 1998 | Data last reviewed in December, 1973 |
Liquid Phase Heat Capacity (Shomate Equation)
Cp° = A + B*t + C*t2 + D*t3 +
E/t2
H° − H°298.15= A*t + B*t2/2 +
C*t3/3 + D*t4/4 − E/t + F − H
S° = A*ln(t) + B*t + C*t2/2 + D*t3/3 −
E/(2*t2) + G
Cp = heat capacity (J/mol*K)
H° = standard enthalpy (kJ/mol)
S° = standard entropy (J/mol*K)
t = temperature (K) / 1000.
View plot Requires a JavaScript / HTML 5 canvas capable browser.
Temperature (K) | 2750. to 5130.824 |
---|---|
A | 33.47200 |
B | 0.000005 |
C | -4.867440×10-8 |
D | -4.541321×10-8 |
E | 0.000058 |
F | 11.86580 |
G | 76.73560 |
H | 29.64670 |
Reference | Chase, 1998 |
Comment | Data last reviewed in December, 1973 |
Solid Phase Heat Capacity (Shomate Equation)
Cp° = A + B*t + C*t2 + D*t3 +
E/t2
H° − H°298.15= A*t + B*t2/2 +
C*t3/3 + D*t4/4 − E/t + F − H
S° = A*ln(t) + B*t + C*t2/2 + D*t3/3 −
E/(2*t2) + G
Cp = heat capacity (J/mol*K)
H° = standard enthalpy (kJ/mol)
S° = standard entropy (J/mol*K)
t = temperature (K) / 1000.
View plot Requires a JavaScript / HTML 5 canvas capable browser.
Temperature (K) | 298. to 2750. |
---|---|
A | 22.01430 |
B | 9.888160 |
C | -5.648530 |
D | 1.759691 |
E | 0.021839 |
F | -6.880890 |
G | 60.52400 |
H | 0.000000 |
Reference | Chase, 1998 |
Comment | Data last reviewed in December, 1973 |

Gas phase ion energetics data

Data evaluated as indicated in comments:
L - Sharon G. Lias
Data compiled as indicated in comments:
LL - Sharon G. Lias and Joel F. Liebman
LBLHLM - Sharon G. Lias, John E. Bartmess, Joel F. Liebman, John L. Holmes, Rhoda D. Levin, and W. Gary Mallard
LLK - Sharon G. Lias, Rhoda D. Levin, and Sherif A. Kafafi
RDSH - Henry M. Rosenstock, Keith Draxl, Bruce W. Steiner, and John T. Herron
B - John E. Bartmess
Quantity | Value | Units | Method | Reference | Comment |
---|---|---|---|---|---|
IE (evaluated) | 6.75885 ± 0.00004 | eV | N/A | N/A | L |
Electron affinity determinations
EA (eV) | Method | Reference | Comment |
---|---|---|---|
0.894 ± 0.025 | LPES | Feigerle, Corderman, et al., 1981 | B |
Ionization energy determinations
IE (eV) | Method | Reference | Comment |
---|---|---|---|
6.75885 | EVAL | Lide, 1992 | LL |
6.75885 ± 0.00004 | LS | Rayner, Mitchell, et al., 1987 | LBLHLM |
6.61 ± 0.05 | EI | Rauh and Ackermann, 1979 | LLK |
10.1 ± 1.0 | EI | Gupta and Gingerich, 1978 | LLK |
6.88 | S | Moore, 1970 | RDSH |

Gas phase thermochemistry data

Quantity | Value | Units | Method | Reference | Comment |
---|---|---|---|---|---|
ΔfH°gas | 175.20 | kcal/mol | Review | Chase, 1998 | Data last reviewed in December, 1973 |
Quantity | Value | Units | Method | Reference | Comment |
S°gas,1 bar | 44.524 | cal/mol*K | Review | Chase, 1998 | Data last reviewed in December, 1973 |
Gas Phase Heat Capacity (Shomate Equation)
Cp° = A + B*t + C*t2 + D*t3 +
E/t2
H° − H°298.15= A*t + B*t2/2 +
C*t3/3 + D*t4/4 − E/t + F − H
S° = A*ln(t) + B*t + C*t2/2 + D*t3/3 −
E/(2*t2) + G
Cp = heat capacity (cal/mol*K)
H° = standard enthalpy (kcal/mol)
S° = standard entropy (cal/mol*K)
t = temperature (K) / 1000.
View plot Requires a JavaScript / HTML 5 canvas capable browser.
Temperature (K) | 5131. to 6000. |
---|---|
A | -3498.327 |
B | 1228.910 |
C | -161.4106 |
D | 7.539436 |
E | 11390.30 |
F | 10163.38 |
G | 1480.418 |
H | 175.2000 |
Reference | Chase, 1998 |
Comment | Data last reviewed in December, 1973 |

Reaction thermochemistry data

Data compiled by: Michael M. Meot-Ner (Mautner) and Sharon G. Lias
Individual Reactions
By formula: Nb+ + Nb = (Nb+ • Nb)
Quantity | Value | Units | Method | Reference | Comment |
---|---|---|---|---|---|
ΔrH° | 136. | kcal/mol | CID | Loh, Lian, et al., 1988 | gas phase; approximate value |
Enthalpy of reaction
ΔrH° (kcal/mol) | T (K) | Method | Reference | Comment |
---|---|---|---|---|
136.0 | CID | Armentrout and Kickel, 1994 | gas phase; guided ion beam CID |
By formula: (Nb+ • 9Nb) + Nb = (Nb+ • 10Nb)
Enthalpy of reaction
ΔrH° (kcal/mol) | T (K) | Method | Reference | Comment |
---|---|---|---|---|
143.4 | CID | Armentrout and Kickel, 1994 | gas phase; guided ion beam CID |
By formula: (Nb+ • 2Nb) + Nb = (Nb+ • 3Nb)
Enthalpy of reaction
ΔrH° (kcal/mol) | T (K) | Method | Reference | Comment |
---|---|---|---|---|
141.0 | CID | Armentrout and Kickel, 1994 | gas phase; guided ion beam CID |
By formula: (Nb+ • 3Nb) + Nb = (Nb+ • 4Nb)
Enthalpy of reaction
ΔrH° (kcal/mol) | T (K) | Method | Reference | Comment |
---|---|---|---|---|
133.1 | CID | Armentrout and Kickel, 1994 | gas phase; guided ion beam CID |
By formula: (Nb+ • 4Nb) + Nb = (Nb+ • 5Nb)
Enthalpy of reaction
ΔrH° (kcal/mol) | T (K) | Method | Reference | Comment |
---|---|---|---|---|
135.8 | CID | Armentrout and Kickel, 1994 | gas phase; guided ion beam CID |
By formula: (Nb+ • 5Nb) + Nb = (Nb+ • 6Nb)
Enthalpy of reaction
ΔrH° (kcal/mol) | T (K) | Method | Reference | Comment |
---|---|---|---|---|
155.4 | CID | Armentrout and Kickel, 1994 | gas phase; guided ion beam CID |
By formula: (Nb+ • 6Nb) + Nb = (Nb+ • 7Nb)
Enthalpy of reaction
ΔrH° (kcal/mol) | T (K) | Method | Reference | Comment |
---|---|---|---|---|
141.5 | CID | Armentrout and Kickel, 1994 | gas phase; guided ion beam CID |
By formula: (Nb+ • 7Nb) + Nb = (Nb+ • 8Nb)
Enthalpy of reaction
ΔrH° (kcal/mol) | T (K) | Method | Reference | Comment |
---|---|---|---|---|
138.2 | CID | Armentrout and Kickel, 1994 | gas phase; guided ion beam CID |
By formula: (Nb+ • 8Nb) + Nb = (Nb+ • 9Nb)
Enthalpy of reaction
ΔrH° (kcal/mol) | T (K) | Method | Reference | Comment |
---|---|---|---|---|
144.4 | CID | Armentrout and Kickel, 1994 | gas phase; guided ion beam CID |
By formula: (Nb+ • Nb) + Nb = (Nb+ • 2Nb)
Enthalpy of reaction
ΔrH° (kcal/mol) | T (K) | Method | Reference | Comment |
---|---|---|---|---|
117.1 | CID | Armentrout and Kickel, 1994 | gas phase; guided ion beam CID |

Ion clustering data

Data compiled by: Michael M. Meot-Ner (Mautner) and Sharon G. Lias

Clustering reactions

Niobium ion (1+) + niobium = (Niobium ion (1+) • niobium)

By formula: Nb+ + Nb = (Nb+ • Nb)

Quantity Value Units Method Reference Comment
Δr569.kJ/molCIDLoh, Lian, et al., 1988gas phase; approximate value

Enthalpy of reaction

ΔrH° (kJ/mol) T (K) Method Reference Comment
569.0 CIDArmentrout and Kickel, 1994gas phase; guided ion beam CID

(Niobium ion (1+) • niobium) + niobium = (Niobium ion (1+) • 2niobium)

By formula: (Nb+ • Nb) + Nb = (Nb+ • 2Nb)

Enthalpy of reaction

ΔrH° (kJ/mol) T (K) Method Reference Comment
489.9 CIDArmentrout and Kickel, 1994gas phase; guided ion beam CID

(Niobium ion (1+) • 2niobium) + niobium = (Niobium ion (1+) • 3niobium)

By formula: (Nb+ • 2Nb) + Nb = (Nb+ • 3Nb)

Enthalpy of reaction

ΔrH° (kJ/mol) T (K) Method Reference Comment
589.9 CIDArmentrout and Kickel, 1994gas phase; guided ion beam CID

(Niobium ion (1+) • 3niobium) + niobium = (Niobium ion (1+) • 4niobium)

By formula: (Nb+ • 3Nb) + Nb = (Nb+ • 4Nb)

Enthalpy of reaction

ΔrH° (kJ/mol) T (K) Method Reference Comment
556.9 CIDArmentrout and Kickel, 1994gas phase; guided ion beam CID

(Niobium ion (1+) • 4niobium) + niobium = (Niobium ion (1+) • 5niobium)

By formula: (Nb+ • 4Nb) + Nb = (Nb+ • 5Nb)

Enthalpy of reaction

ΔrH° (kJ/mol) T (K) Method Reference Comment
568.2 CIDArmentrout and Kickel, 1994gas phase; guided ion beam CID

(Niobium ion (1+) • 5niobium) + niobium = (Niobium ion (1+) • 6niobium)

By formula: (Nb+ • 5Nb) + Nb = (Nb+ • 6Nb)

Enthalpy of reaction

ΔrH° (kJ/mol) T (K) Method Reference Comment
650.2 CIDArmentrout and Kickel, 1994gas phase; guided ion beam CID

(Niobium ion (1+) • 6niobium) + niobium = (Niobium ion (1+) • 7niobium)

By formula: (Nb+ • 6Nb) + Nb = (Nb+ • 7Nb)

Enthalpy of reaction

ΔrH° (kJ/mol) T (K) Method Reference Comment
592.0 CIDArmentrout and Kickel, 1994gas phase; guided ion beam CID

(Niobium ion (1+) • 7niobium) + niobium = (Niobium ion (1+) • 8niobium)

By formula: (Nb+ • 7Nb) + Nb = (Nb+ • 8Nb)

Enthalpy of reaction

ΔrH° (kJ/mol) T (K) Method Reference Comment
578.2 CIDArmentrout and Kickel, 1994gas phase; guided ion beam CID

(Niobium ion (1+) • 8niobium) + niobium = (Niobium ion (1+) • 9niobium)

By formula: (Nb+ • 8Nb) + Nb = (Nb+ • 9Nb)

Enthalpy of reaction

ΔrH° (kJ/mol) T (K) Method Reference Comment
604.2 CIDArmentrout and Kickel, 1994gas phase; guided ion beam CID

(Niobium ion (1+) • 9niobium) + niobium = (Niobium ion (1+) • 10niobium)

By formula: (Nb+ • 9Nb) + Nb = (Nb+ • 10Nb)

Enthalpy of reaction

ΔrH° (kJ/mol) T (K) Method Reference Comment
600.0 CIDArmentrout and Kickel, 1994gas phase; guided ion beam CID

References

Chase, 1998
Chase, M.W., Jr.,
NIST-JANAF Themochemical Tables, Fourth Edition,
J. Phys. Chem. Ref. Data, Monograph 9, 1998, 1-1951. [all data]
Feigerle, Corderman, et al., 1981
Feigerle, C.S.; Corderman, R.R.; Bobashev, S.V.; Lineberger, W.C.,
Binding Energies and Structure of Transition Metal Negative Ions,
J. Chem. Phys., 1981, 74, 3, 1580, https://doi.org/10.1063/1.441289
. [all data]
Lide, 1992
Lide, D.R. (Editor),
Ionization potentials of atoms and atomic ions
in Handbook of Chem. and Phys., 1992, 10-211. [all data]
Rayner, Mitchell, et al., 1987
Rayner, D.M.; Mitchell, S.A.; Bourne, O.L.; Hackett, P.A.,
First-ionization potential of niobium and molybdenum by double-resonance, field-ionization spectroscopy,
J. Opt. Soc. Am. B, 1987, 4, 900. [all data]
Rauh and Ackermann, 1979
Rauh, E.G.; Ackermann, R.J.,
The first ionization potentials of the transition metals,
J. Chem. Phys., 1979, 70, 1004. [all data]
Gupta and Gingerich, 1978
Gupta, S.K.; Gingerich, K.A.,
Mass spectrometric observation dissociation energy of the gaseous molecule MoNb,
J. Chem. Phys., 1978, 69, 4318. [all data]
Moore, 1970
Moore, C.E.,
Ionization potentials and ionization limits derived from the analyses of optical spectra,
Natl. Stand. Ref. Data Ser., (U.S. Natl. Bur. Stand.), 1970, 34, 1. [all data]