magnesium
- Formula: Mg
- Molecular weight: 24.3050
- IUPAC Standard InChIKey: FYYHWMGAXLPEAU-UHFFFAOYSA-N
- CAS Registry Number: 7439-95-4
- Chemical structure:
- NIST Atomic Spectra Database - Lines Holdings (on physics web site)
- NIST Atomic Spectra Database - Levels Holdings (on physics web site)
- NIST Atomic Spectra Database - Ground states and ionization energies (on physics web site)
- Gas Phase Kinetics Database
- X-ray Photoelectron Spectroscopy Database, version 5.0

Gas phase thermochemistry data

Quantity | Value | Units | Method | Reference | Comment |
---|---|---|---|---|---|
ΔfH°gas | 147.1 ± 0.8 | kJ/mol | Review | Cox, Wagman, et al., 1984 | CODATA Review value |
ΔfH°gas | 147.10 | kJ/mol | Review | Chase, 1998 | Data last reviewed in September, 1983 |
Quantity | Value | Units | Method | Reference | Comment |
S°gas,1 bar | 148.648 ± 0.003 | J/mol*K | Review | Cox, Wagman, et al., 1984 | CODATA Review value |
S°gas,1 bar | 148.65 | J/mol*K | Review | Chase, 1998 | Data last reviewed in September, 1983 |
Gas Phase Heat Capacity (Shomate Equation)
Cp° = A + B*t + C*t2 + D*t3 +
E/t2
H° − H°298.15= A*t + B*t2/2 +
C*t3/3 + D*t4/4 − E/t + F − H
S° = A*ln(t) + B*t + C*t2/2 + D*t3/3 −
E/(2*t2) + G
Cp = heat capacity (J/mol*K)
H° = standard enthalpy (kJ/mol)
S° = standard entropy (J/mol*K)
t = temperature (K) / 1000.
View plot Requires a JavaScript / HTML 5 canvas capable browser.
Temperature (K) | 1366.104 to 2200. | 2200. to 6000. |
---|---|---|
A | 20.77306 | 47.60848 |
B | 0.035592 | -15.40875 |
C | -0.031917 | 2.875965 |
D | 0.009109 | -0.120806 |
E | 0.000461 | -27.01764 |
F | 140.9071 | 97.40017 |
G | 173.7799 | 177.2305 |
H | 147.1002 | 147.1002 |
Reference | Chase, 1998 | Chase, 1998 |
Comment | Data last reviewed in September, 1983 | Data last reviewed in September, 1983 |

Condensed phase thermochemistry data

Quantity | Value | Units | Method | Reference | Comment |
---|---|---|---|---|---|
ΔfH°liquid | 4.79 | kJ/mol | Review | Chase, 1998 | Data last reviewed in September, 1983 |
Quantity | Value | Units | Method | Reference | Comment |
S°liquid,1 bar | 34.46 | J/mol*K | Review | Chase, 1998 | Data last reviewed in September, 1983 |
Quantity | Value | Units | Method | Reference | Comment |
S°solid,1 bar | 32.67 ± 0.10 | J/mol*K | Review | Cox, Wagman, et al., 1984 | CODATA Review value |
Quantity | Value | Units | Method | Reference | Comment |
S°solid | 32.67 | J/mol*K | Review | Chase, 1998 | Data last reviewed in September, 1983 |
Liquid Phase Heat Capacity (Shomate Equation)
Cp° = A + B*t + C*t2 + D*t3 +
E/t2
H° − H°298.15= A*t + B*t2/2 +
C*t3/3 + D*t4/4 − E/t + F − H
S° = A*ln(t) + B*t + C*t2/2 + D*t3/3 −
E/(2*t2) + G
Cp = heat capacity (J/mol*K)
H° = standard enthalpy (kJ/mol)
S° = standard entropy (J/mol*K)
t = temperature (K) / 1000.
View plot Requires a JavaScript / HTML 5 canvas capable browser.
Temperature (K) | 923. to 1366.104 |
---|---|
A | 34.30901 |
B | -7.471034×10-10 |
C | 6.146212×10-10 |
D | -1.598238×10-10 |
E | -1.152011×10-11 |
F | -5.439367 |
G | 75.98311 |
H | 4.790011 |
Reference | Chase, 1998 |
Comment | Data last reviewed in September, 1983 |
Solid Phase Heat Capacity (Shomate Equation)
Cp° = A + B*t + C*t2 + D*t3 +
E/t2
H° − H°298.15= A*t + B*t2/2 +
C*t3/3 + D*t4/4 − E/t + F − H
S° = A*ln(t) + B*t + C*t2/2 + D*t3/3 −
E/(2*t2) + G
Cp = heat capacity (J/mol*K)
H° = standard enthalpy (kJ/mol)
S° = standard entropy (J/mol*K)
t = temperature (K) / 1000.
View plot Requires a JavaScript / HTML 5 canvas capable browser.
Temperature (K) | 298. to 923. |
---|---|
A | 26.54083 |
B | -1.533048 |
C | 8.062443 |
D | 0.572170 |
E | -0.174221 |
F | -8.501596 |
G | 63.90181 |
H | 0.000000 |
Reference | Chase, 1998 |
Comment | Data last reviewed in September, 1983 |

Phase change data

Data compiled by: Thermodynamics Research Center, NIST Boulder Laboratories, Chris Muzny director
Quantity | Value | Units | Method | Reference | Comment |
---|---|---|---|---|---|
Tboil | 1363. | K | N/A | Honig and Kramer, 1969 | Uncertainty assigned by TRC = 1.5 K |
Quantity | Value | Units | Method | Reference | Comment |
Ttriple | 922. | K | N/A | Honig and Kramer, 1969 | Uncertainty assigned by TRC = 0.6 K |

Gas phase ion energetics data

Data evaluated as indicated in comments:
HL - Edward P. Hunter and Sharon G. Lias
L - Sharon G. Lias
Data compiled as indicated in comments:
LL - Sharon G. Lias and Joel F. Liebman
LBLHLM - Sharon G. Lias, John E. Bartmess, Joel F. Liebman, John L. Holmes, Rhoda D. Levin, and W. Gary Mallard
LLK - Sharon G. Lias, Rhoda D. Levin, and Sherif A. Kafafi
RDSH - Henry M. Rosenstock, Keith Draxl, Bruce W. Steiner, and John T. Herron
Quantity | Value | Units | Method | Reference | Comment |
---|---|---|---|---|---|
IE (evaluated) | 7.64624 | eV | N/A | N/A | L |
Quantity | Value | Units | Method | Reference | Comment |
Proton affinity (review) | 819.6 | kJ/mol | N/A | Hunter and Lias, 1998 | HL |
Quantity | Value | Units | Method | Reference | Comment |
Gas basicity | 797.3 | kJ/mol | N/A | Hunter and Lias, 1998 | HL |
Ionization energy determinations
IE (eV) | Method | Reference | Comment |
---|---|---|---|
7.64624 | EVAL | Lide, 1992 | LL |
7.646 | S | Kelly, 1987 | LBLHLM |
7.3 | EI | Sasamoto, Hara, et al., 1981 | LLK |
7.72 ± 0.05 | EI | Rauh and Ackermann, 1979 | LLK |
7.63 ± 0.08 | EI | Rauh and Ackermann, 1974 | LLK |
7.646 | S | Moore, 1970 | RDSH |
7.64623 | S | Risberg, 1965 | RDSH |
7.5 ± 0.2 | SI | Zinkiewicz, 1553 | RDSH |

Reaction thermochemistry data

Data compiled by: José A. Martinho Simões
Individual Reactions
(l) +
(cr) = C9H19BrMg (solution)
By formula: BrNO (l) + Mg (cr) = C9H19BrMg (solution)
Quantity | Value | Units | Method | Reference | Comment |
---|---|---|---|---|---|
ΔrH° | -231.0 ± 4.4 | kJ/mol | RSC | Holm, 1981 | solvent: Diethyl ether; Due to the possibility of side reactions, the enthalpy of reaction was not considered to be sufficiently reliable for deriving the enthalpy of formation of the Grignard reagent Holm, 1981 |
(l) +
(cr) = C7H7BrMg (solution)
By formula: C7H7Br (l) + Mg (cr) = C7H7BrMg (solution)
Quantity | Value | Units | Method | Reference | Comment |
---|---|---|---|---|---|
ΔrH° | -275.7 ± 4.4 | kJ/mol | RSC | Holm, 1981 | solvent: Diethyl ether; Due to the possibility of side reactions, the enthalpy of reaction was not considered to be sufficiently reliable for deriving the enthalpy of formation of the Grignard reagent Holm, 1981 |
(cr) +
(l) = CH3BrMg (solution)
By formula: Mg (cr) + CH3Br (l) = CH3BrMg (solution)
Quantity | Value | Units | Method | Reference | Comment |
---|---|---|---|---|---|
ΔrH° | -267.8 ± 4.4 | kJ/mol | RSC | Holm, 1981 | solvent: Diethyl ether; Due to the possibility of side reactions, the enthalpy of reaction was not considered to be sufficiently reliable for deriving the enthalpy of formation of the Grignard reagent Holm, 1981 |
(cr) +
(solution) = CH3IMg (solution)
By formula: Mg (cr) + CH3I (solution) = CH3IMg (solution)
Quantity | Value | Units | Method | Reference | Comment |
---|---|---|---|---|---|
ΔrH° | -273.6 ± 0.8 | kJ/mol | RSC | Carson and Skinner, 1950 | solvent: Diethyl ether; It was assumed that MeI(l) has a negligible solution enthalpy in ether |
By formula: 2C5H6 (l) + Mg (cr) = C10H10Mg (cr) + H2 (g)
Quantity | Value | Units | Method | Reference | Comment |
---|---|---|---|---|---|
ΔrH° | -142.5 ± 2.9 | kJ/mol | RSC | Hull, Reid, et al., 1967 | Please also see Pedley and Rylance, 1977 and Cox and Pilcher, 1970. |

References

Cox, Wagman, et al., 1984
Cox, J.D.; Wagman, D.D.; Medvedev, V.A.,
CODATA Key Values for Thermodynamics, Hemisphere Publishing Corp., New York, 1984, 1. [all data]
Chase, 1998
Chase, M.W., Jr.,
NIST-JANAF Themochemical Tables, Fourth Edition,
J. Phys. Chem. Ref. Data, Monograph 9, 1998, 1-1951. [all data]
Honig and Kramer, 1969
Honig, R.E.; Kramer, D.A.,
Vapor pressure data for the solid and liquid elements,
RCA Rev., 1969, 1969, 285. [all data]
Hunter and Lias, 1998
Hunter, E.P.; Lias, S.G.,
Evaluated Gas Phase Basicities and Proton Affinities of Molecules: An Update,
J. Phys. Chem. Ref. Data, 1998, 27, 3, 413-656, https://doi.org/10.1063/1.556018
. [all data]
Lide, 1992
Lide, D.R. (Editor),
Ionization potentials of atoms and atomic ions
in Handbook of Chem. and Phys., 1992, 10-211. [all data]
Kelly, 1987
Kelly, R.L.,
Atomic and ionic spectrum lines of hydrogen through kryton,
J. Phys. Chem. Ref. Data, 1987, 16. [all data]
Sasamoto, Hara, et al., 1981
Sasamoto, T.; Hara, H.; Sata, T.,
Mass spectrometric study of the vaporization of magnesium oxide from magnesium aluminate spinel,
Bull. Chem. Soc. Jpn., 1981, 54, 3327. [all data]
Rauh and Ackermann, 1979
Rauh, E.G.; Ackermann, R.J.,
The first ionization potentials of the transition metals,
J. Chem. Phys., 1979, 70, 1004. [all data]
Rauh and Ackermann, 1974
Rauh, E.G.; Ackermann, R.J.,
First ionization potentials of some refractory oxide vapors,
J. Chem. Phys., 1974, 60, 1396. [all data]
Moore, 1970
Moore, C.E.,
Ionization potentials and ionization limits derived from the analyses of optical spectra,
Natl. Stand. Ref. Data Ser., (U.S. Natl. Bur. Stand.), 1970, 34, 1. [all data]
Risberg, 1965
Risberg, G.,
The spectrum of atomic magnesium, Mg I,
Ark. Fys., 1965, 28, 381. [all data]
Zinkiewicz, 1553
Zinkiewicz, J.M.,
Determination of the ionization potential of Ca and Mg atoms by the surface ionization method using a mass spectrometer,
Proc. Colloq. Spectros. Intern., 14th Debrecen, Hung., 1967,, 1553, 3. [all data]