lithium
- Formula: Li
- Molecular weight: 6.941
- IUPAC Standard InChIKey: WHXSMMKQMYFTQS-UHFFFAOYSA-N
- CAS Registry Number: 7439-93-2
- Chemical structure:
- NIST Atomic Spectra Database - Lines Holdings (on physics web site)
- NIST Atomic Spectra Database - Levels Holdings (on physics web site)
- NIST Atomic Spectra Database - Ground states and ionization energies (on physics web site)
- Electron-Impact Ionization Cross Sections (on physics web site)
- Gas Phase Kinetics Database
- X-ray Photoelectron Spectroscopy Database, version 5.0

Condensed phase thermochemistry data

Quantity | Value | Units | Method | Reference | Comment |
---|---|---|---|---|---|
ΔfH°liquid | 2.38 | kJ/mol | Review | Chase, 1998 | Data last reviewed in June, 1962 |
Quantity | Value | Units | Method | Reference | Comment |
S°liquid,1 bar | 33.94 | J/mol*K | Review | Chase, 1998 | Data last reviewed in June, 1962 |
Quantity | Value | Units | Method | Reference | Comment |
S°solid,1 bar | 29.12 ± 0.20 | J/mol*K | Review | Cox, Wagman, et al., 1984 | CODATA Review value |
Quantity | Value | Units | Method | Reference | Comment |
S°solid | 29.09 | J/mol*K | Review | Chase, 1998 | Data last reviewed in June, 1962 |
Liquid Phase Heat Capacity (Shomate Equation)
Cp° = A + B*t + C*t2 + D*t3 +
E/t2
H° − H°298.15= A*t + B*t2/2 +
C*t3/3 + D*t4/4 − E/t + F − H
S° = A*ln(t) + B*t + C*t2/2 + D*t3/3 −
E/(2*t2) + G
Cp = heat capacity (J/mol*K)
H° = standard enthalpy (kJ/mol)
S° = standard entropy (J/mol*K)
t = temperature (K) / 1000.
View plot Requires a JavaScript / HTML 5 canvas capable browser.
Temperature (K) | 453.69 to 700. | 700. to 1620.12 |
---|---|---|
A | 32.46972 | 26.00896 |
B | -2.635975 | 5.632375 |
C | -6.327128 | -4.013227 |
D | 4.230359 | 0.873686 |
E | 0.005686 | 0.344150 |
F | -7.117319 | -4.199690 |
G | 74.29361 | 66.36284 |
H | 2.380002 | 2.380002 |
Reference | Chase, 1998 | Chase, 1998 |
Comment | Data last reviewed in June, 1962 | Data last reviewed in June, 1962 |
Solid Phase Heat Capacity (Shomate Equation)
Cp° = A + B*t + C*t2 + D*t3 +
E/t2
H° − H°298.15= A*t + B*t2/2 +
C*t3/3 + D*t4/4 − E/t + F − H
S° = A*ln(t) + B*t + C*t2/2 + D*t3/3 −
E/(2*t2) + G
Cp = heat capacity (J/mol*K)
H° = standard enthalpy (kJ/mol)
S° = standard entropy (J/mol*K)
t = temperature (K) / 1000.
View plot Requires a JavaScript / HTML 5 canvas capable browser.
Temperature (K) | 298. to 453. |
---|---|
A | 169.5520 |
B | -882.7110 |
C | 1977.438 |
D | -1487.312 |
E | -1.609635 |
F | -31.24825 |
G | 413.6466 |
H | 0.000000 |
Reference | Chase, 1998 |
Comment | Data last reviewed in June, 1962 |

Phase change data

Antoine Equation Parameters
log10(P) = A − (B / (T + C))
P = vapor pressure (bar)
T = temperature (K)
View plot Requires a JavaScript / HTML 5 canvas capable browser.
Temperature (K) | A | B | C | Reference | Comment |
---|---|---|---|---|---|
298.14 to 1599.99 | 4.98831 | 7918.984 | -9.52 | Hicks, 1963 | Coefficents calculated by NIST from author's data. |
1204. to 1353. | 1.58992 | 1603.966 | -711.088 | Hartmann and Schneider, 1929 | Coefficents calculated by NIST from author's data. |

Gas phase ion energetics data

Data evaluated as indicated in comments:
L - Sharon G. Lias
Data compiled as indicated in comments:
LL - Sharon G. Lias and Joel F. Liebman
LBLHLM - Sharon G. Lias, John E. Bartmess, Joel F. Liebman, John L. Holmes, Rhoda D. Levin, and W. Gary Mallard
LLK - Sharon G. Lias, Rhoda D. Levin, and Sherif A. Kafafi
RDSH - Henry M. Rosenstock, Keith Draxl, Bruce W. Steiner, and John T. Herron
Quantity | Value | Units | Method | Reference | Comment |
---|---|---|---|---|---|
IE (evaluated) | 5.39172 | eV | N/A | N/A | L |
Ionization energy determinations
IE (eV) | Method | Reference | Comment |
---|---|---|---|
5.39172 | EVAL | Lide, 1992 | LL |
5.36 ± 0.01 | PI | Dugourd, Rayane, et al., 1992 | LL |
5.392 | S | Kelly, 1987 | LBLHLM |
5.4 ± 0.2 | EI | Nakagawa, Asano, et al., 1981 | LLK |
5.5 ± 0.3 | EI | N/A | LLK |
5.4 | EI | Zmbov, Wu, et al., 1977 | LLK |
5.39172 | S | Moore, 1970 | RDSH |

Gas phase thermochemistry data

Quantity | Value | Units | Method | Reference | Comment |
---|---|---|---|---|---|
ΔfH°gas | 159.3 ± 1.0 | kJ/mol | Review | Cox, Wagman, et al., 1984 | CODATA Review value |
ΔfH°gas | 159.30 | kJ/mol | Review | Chase, 1998 | Data last reviewed in June, 1962 |
Quantity | Value | Units | Method | Reference | Comment |
S°gas,1 bar | 138.782 ± 0.010 | J/mol*K | Review | Cox, Wagman, et al., 1984 | CODATA Review value |
S°gas,1 bar | 138.78 | J/mol*K | Review | Chase, 1998 | Data last reviewed in June, 1962 |
Gas Phase Heat Capacity (Shomate Equation)
Cp° = A + B*t + C*t2 + D*t3 +
E/t2
H° − H°298.15= A*t + B*t2/2 +
C*t3/3 + D*t4/4 − E/t + F − H
S° = A*ln(t) + B*t + C*t2/2 + D*t3/3 −
E/(2*t2) + G
Cp = heat capacity (J/mol*K)
H° = standard enthalpy (kJ/mol)
S° = standard entropy (J/mol*K)
t = temperature (K) / 1000.
View plot Requires a JavaScript / HTML 5 canvas capable browser.
Temperature (K) | 1620.12 to 6000. |
---|---|
A | 23.33408 |
B | -2.772423 |
C | 0.767421 |
D | -0.003595 |
E | -0.035246 |
F | 151.5035 |
G | 166.1885 |
H | 159.3004 |
Reference | Chase, 1998 |
Comment | Data last reviewed in June, 1962 |

Reaction thermochemistry data

Data compiled by: José A. Martinho Simões
Individual Reactions
By formula: CH3Li (g) = Li (g) + CH4 (g)
Quantity | Value | Units | Method | Reference | Comment |
---|---|---|---|---|---|
ΔrH° | 276. | kJ/mol | N/A | Smith and Patrick, 1983 |

References

Chase, 1998
Chase, M.W., Jr.,
NIST-JANAF Themochemical Tables, Fourth Edition,
J. Phys. Chem. Ref. Data, Monograph 9, 1998, 1-1951. [all data]
Cox, Wagman, et al., 1984
Cox, J.D.; Wagman, D.D.; Medvedev, V.A.,
CODATA Key Values for Thermodynamics, Hemisphere Publishing Corp., New York, 1984, 1. [all data]
Hicks, 1963
Hicks, W.T.,
Evaluation of Vapor-Pressure Data of Mercury, Lithium, Sodium, and Potassium,
J. Chem. Phys., 1963, 38, 8, 1873-1880, https://doi.org/10.1063/1.1733889
. [all data]
Hartmann and Schneider, 1929
Hartmann, H.; Schneider, R.,
Die Siedetemperaturen von Magnesium, Calcium, Strontium, Barium and Lithium,
Z. Anorg. Allg. Chem., 1929, 180, 1, 275-283, https://doi.org/10.1002/zaac.19291800129
. [all data]
Lide, 1992
Lide, D.R. (Editor),
Ionization potentials of atoms and atomic ions
in Handbook of Chem. and Phys., 1992, 10-211. [all data]
Dugourd, Rayane, et al., 1992
Dugourd, P.; Rayane, D.; Labastie, P.; Vezin, B.; Chevaleyre, J.; Broyer, M.,
Measurements of lithium cluster ionization potentials,
Chem. Phys. Lett., 1992, 197, 433. [all data]
Kelly, 1987
Kelly, R.L.,
Atomic and ionic spectrum lines of hydrogen through kryton,
J. Phys. Chem. Ref. Data, 1987, 16. [all data]
Nakagawa, Asano, et al., 1981
Nakagawa, H.; Asano, M.; Kubo, K.,
Mass spectrometric study of the vaporization of lithium metasilicate,
J. Nucl. Mater., 1981, 102, 292. [all data]
Zmbov, Wu, et al., 1977
Zmbov, K.F.; Wu, C.H.; Ihle, H.R.,
A mass spectrometric study of heteronuclear diatomic alkali metal molecules. Dissociation energies ionization potentials of NaLi, KLi, NaK,
J. Chem. Phys., 1977, 67, 4603. [all data]
Moore, 1970
Moore, C.E.,
Ionization potentials and ionization limits derived from the analyses of optical spectra,
Natl. Stand. Ref. Data Ser., (U.S. Natl. Bur. Stand.), 1970, 34, 1. [all data]