iron
- Formula: Fe
- Molecular weight: 55.845
- IUPAC Standard InChIKey: XEEYBQQBJWHFJM-UHFFFAOYSA-N
- CAS Registry Number: 7439-89-6
- Chemical structure:
- NIST Atomic Spectra Database - Lines Holdings (on physics web site)
- NIST Atomic Spectra Database - Levels Holdings (on physics web site)
- NIST Atomic Spectra Database - Ground states and ionization energies (on physics web site)
- Gas Phase Kinetics Database
- X-ray Photoelectron Spectroscopy Database, version 5.0

Gas phase thermochemistry data

Quantity | Value | Units | Method | Reference | Comment |
---|---|---|---|---|---|
ΔfH°gas | 415.47 | kJ/mol | Review | Chase, 1998 | Data last reviewed in March, 1978 |
Quantity | Value | Units | Method | Reference | Comment |
S°gas,1 bar | 180.49 | J/mol*K | Review | Chase, 1998 | Data last reviewed in March, 1978 |
Gas Phase Heat Capacity (Shomate Equation)
Cp° = A + B*t + C*t2 + D*t3 +
E/t2
H° − H°298.15= A*t + B*t2/2 +
C*t3/3 + D*t4/4 − E/t + F − H
S° = A*ln(t) + B*t + C*t2/2 + D*t3/3 −
E/(2*t2) + G
Cp = heat capacity (J/mol*K)
H° = standard enthalpy (kJ/mol)
S° = standard entropy (J/mol*K)
t = temperature (K) / 1000.
View plot Requires a JavaScript / HTML 5 canvas capable browser.
Temperature (K) | 3133.345 to 6000. |
---|---|
A | 11.29253 |
B | 6.989707 |
C | -1.110305 |
D | 0.122354 |
E | 5.689278 |
F | 423.5380 |
G | 206.3591 |
H | 415.4716 |
Reference | Chase, 1998 |
Comment | Data last reviewed in March, 1978 |

Condensed phase thermochemistry data

Quantity | Value | Units | Method | Reference | Comment |
---|---|---|---|---|---|
ΔfH°liquid | 12.40 | kJ/mol | Review | Chase, 1998 | Data last reviewed in March, 1978 |
Quantity | Value | Units | Method | Reference | Comment |
S°liquid,1 bar | 34.76 | J/mol*K | Review | Chase, 1998 | Data last reviewed in March, 1978 |
Liquid Phase Heat Capacity (Shomate Equation)
Cp° = A + B*t + C*t2 + D*t3 +
E/t2
H° − H°298.15= A*t + B*t2/2 +
C*t3/3 + D*t4/4 − E/t + F − H
S° = A*ln(t) + B*t + C*t2/2 + D*t3/3 −
E/(2*t2) + G
Cp = heat capacity (J/mol*K)
H° = standard enthalpy (kJ/mol)
S° = standard entropy (J/mol*K)
t = temperature (K) / 1000.
View plot Requires a JavaScript / HTML 5 canvas capable browser.
Temperature (K) | 1809. to 3133.345 |
---|---|
A | 46.02400 |
B | -1.884667×10-8 |
C | 6.094750×10-9 |
D | -6.640301×10-10 |
E | -8.246121×10-9 |
F | -10.80543 |
G | 72.54094 |
H | 12.39502 |
Reference | Chase, 1998 |
Comment | Data last reviewed in March, 1978 |
Solid Phase Heat Capacity (Shomate Equation)
Cp° = A + B*t + C*t2 + D*t3 +
E/t2
H° − H°298.15= A*t + B*t2/2 +
C*t3/3 + D*t4/4 − E/t + F − H
S° = A*ln(t) + B*t + C*t2/2 + D*t3/3 −
E/(2*t2) + G
Cp = heat capacity (J/mol*K)
H° = standard enthalpy (kJ/mol)
S° = standard entropy (J/mol*K)
t = temperature (K) / 1000.
View plot Requires a JavaScript / HTML 5 canvas capable browser.
Temperature (K) | 298. to 700. | 700. to 1042. | 1042. to 1100. | 1100. to 1809. | 298. to 1809. |
---|---|---|---|---|---|
A | 18.42868 | -57767.65 | -325.8859 | -776.7387 | 23.97449 |
B | 24.64301 | 137919.7 | 28.92876 | 919.4005 | 8.367750 |
C | -8.913720 | -122773.2 | 0.000000 | -383.7184 | 0.000277 |
D | 9.664706 | 38682.42 | 0.000000 | 57.08148 | -0.000086 |
E | -0.012643 | 3993.080 | 411.9629 | 242.1369 | -0.000005 |
F | -6.573022 | 24078.67 | 745.8231 | 697.6234 | 0.268027 |
G | 42.51488 | -87364.01 | 241.8766 | -558.3674 | 62.06336 |
H | 0.000000 | 0.000000 | 0.000000 | 0.000000 | 7.788015 |
Reference | Chase, 1998 | Chase, 1998 | Chase, 1998 | Chase, 1998 | Chase, 1998 |
Comment | α-δ phase; Data last reviewed in March, 1978 | α-δ phase; Data last reviewed in March, 1978 | α-δ phase; Data last reviewed in March, 1978 | α-δ phase; Data last reviewed in March, 1978 | γ phase; Data last reviewed in March, 1978 |

Gas phase ion energetics data

Data evaluated as indicated in comments:
HL - Edward P. Hunter and Sharon G. Lias
L - Sharon G. Lias
Data compiled as indicated in comments:
LL - Sharon G. Lias and Joel F. Liebman
LBLHLM - Sharon G. Lias, John E. Bartmess, Joel F. Liebman, John L. Holmes, Rhoda D. Levin, and W. Gary Mallard
LLK - Sharon G. Lias, Rhoda D. Levin, and Sherif A. Kafafi
RDSH - Henry M. Rosenstock, Keith Draxl, Bruce W. Steiner, and John T. Herron
B - John E. Bartmess
Quantity | Value | Units | Method | Reference | Comment |
---|---|---|---|---|---|
IE (evaluated) | 7.9024 ± 0.0001 | eV | N/A | N/A | L |
Quantity | Value | Units | Method | Reference | Comment |
Proton affinity (review) | 754. | kJ/mol | N/A | Hunter and Lias, 1998 | HL |
Quantity | Value | Units | Method | Reference | Comment |
Gas basicity | 731.1 | kJ/mol | N/A | Hunter and Lias, 1998 | HL |
Electron affinity determinations
EA (eV) | Method | Reference | Comment |
---|---|---|---|
0.31 ± 0.20 | D-EA | Miller, Miller, et al., 1993 | Acidity stronger than EtCO2H, comparable to HCO2H.; B |
0.1510 ± 0.0030 | LPES | Leopold and Lineberger, 1986 | B |
0.164 ± 0.035 | LPES | Engelking and Lineberger, 1979 | B |
0.140 ± 0.050 | LPES | Engelking and Lineberger, 1976 | B |
<0.25 ± 0.20 | EIAE | Compton and Stockdale, 1976 | From Fe(CO)5; B |
Ionization energy determinations
IE (eV) | Method | Reference | Comment |
---|---|---|---|
7.92 | EI | Russell, Solouki, et al., 1995 | LL |
7.9024 | EVAL | Lide, 1992 | LL |
7.870 | S | Kelly, 1987 | LBLHLM |
7.9023 ± 0.0001 | S | Sugar and Corliss, 1985 | LBLHLM |
7.90 | PE | Dyke, Gravenor, et al., 1982 | LBLHLM |
7.7 ± 0.2 | EI | Clements and Sale, 1976 | LLK |
8.0 ± 0.5 | EI | Hildenbrand, 1975 | LLK |
7.870 | S | Moore, 1970 | RDSH |

Reaction thermochemistry data

Data compiled as indicated in comments:
MS - José A. Martinho Simões
M - Michael M. Meot-Ner (Mautner) and Sharon G. Lias
B - John E. Bartmess
Individual Reactions
CFeO (g) = (g) +
(g)
By formula: CFeO (g) = CO (g) + Fe (g)
Quantity | Value | Units | Method | Reference | Comment |
---|---|---|---|---|---|
ΔrH° | 8.4 ± 3.5 | kcal/mol | FA-SIFT | Sunderlin, Wang, et al., 1992 | MS |
ΔrH° | <39.0 | kcal/mol | N/A | Venkataraman, Bandukwalla, et al., 1989 | Method: Velocity distributions of photofragments from Fe(CO)5.; MS |
ΔrH° | 21. ± 6.9 | kcal/mol | N/A | Engelking and Lineberger, 1979 | Please also see Compton and Stockdale, 1976. Method: LPS and collision with low energy electrons.; MS |
By formula: Fe+ + Fe = (Fe+ • Fe)
Quantity | Value | Units | Method | Reference | Comment |
---|---|---|---|---|---|
ΔrH° | 62. | kcal/mol | CID | Loh, Lian, et al., 1988 | gas phase; M |
ΔrH° | 62.4 | kcal/mol | PDiss | Tecklenberg, Bricker, et al., 1988 | gas phase; ΔrH>; M |
Enthalpy of reaction
ΔrH° (kcal/mol) | T (K) | Method | Reference | Comment |
---|---|---|---|---|
64.1 | CID | Armentrout and Kickel, 1994 | gas phase; guided ion beam CID; M |
By formula: (Fe+ • Fe) + Fe = (Fe+ • 2Fe)
Quantity | Value | Units | Method | Reference | Comment |
---|---|---|---|---|---|
ΔrH° | 55.6 | kcal/mol | PDiss | Tecklenberg, Bricker, et al., 1988 | gas phase; ΔrH<; M |
Enthalpy of reaction
ΔrH° (kcal/mol) | T (K) | Method | Reference | Comment |
---|---|---|---|---|
40.4 | CID | Armentrout and Kickel, 1994 | gas phase; guided ion beam CID; M |
By formula: (Fe+ • 2Fe) + Fe = (Fe+ • 3Fe)
Quantity | Value | Units | Method | Reference | Comment |
---|---|---|---|---|---|
ΔrH° | 41.5 | kcal/mol | CID | Loh, Lian, et al., 1988 | gas phase; M |
Enthalpy of reaction
ΔrH° (kcal/mol) | T (K) | Method | Reference | Comment |
---|---|---|---|---|
51.6 | CID | Armentrout and Kickel, 1994 | gas phase; guided ion beam CID; M |
By formula: (FeO- • 4294967295Fe) + Fe = FeO-
Quantity | Value | Units | Method | Reference | Comment |
---|---|---|---|---|---|
ΔrH° | 94.3 ± 4.0 | kcal/mol | N/A | Drechsler, Boesl, et al., 1997 | gas phase; B |
ΔrH° | 94.3 ± 7.0 | kcal/mol | Ther | Engelking and Lineberger, 1977 | gas phase; B |
C12Fe3O12 (cr) = 12 (g) + 3
(cr)
By formula: C12Fe3O12 (cr) = 12CO (g) + 3Fe (cr)
Quantity | Value | Units | Method | Reference | Comment |
---|---|---|---|---|---|
ΔrH° | 123.2 ± 2.8 | kcal/mol | TD-HFC | Connor, Skinner, et al., 1973 | MS |
ΔrH° | 125.7 ± 3.0 | kcal/mol | HAL-HFC | Connor, Skinner, et al., 1973 | MS |
C6H4FeO4 (l) = 4 (g) +
(cr) +
(g)
By formula: C6H4FeO4 (l) = 4CO (g) + Fe (cr) + C2H4 (g)
Quantity | Value | Units | Method | Reference | Comment |
---|---|---|---|---|---|
ΔrH° | 46.0 ± 2.0 | kcal/mol | HAL-HFC | Brown, Connor, et al., 1976 | MS |
ΔrH° | 44.31 | kcal/mol | TD-HFC | Brown, Connor, et al., 1976 | MS |
C9Fe2O9 (cr) = 9 (g) + 2
(cr)
By formula: C9Fe2O9 (cr) = 9CO (g) + 2Fe (cr)
Quantity | Value | Units | Method | Reference | Comment |
---|---|---|---|---|---|
ΔrH° | 99.4 ± 1.0 | kcal/mol | TD-HFC | Connor, Skinner, et al., 1973 | MS |
ΔrH° | 98.8 ± 1.2 | kcal/mol | HAL-HFC | Connor, Skinner, et al., 1973 | MS |
By formula: (Fe+ • 3CO • 2Fe) + CO = (Fe+ • 4CO • 2Fe)
Quantity | Value | Units | Method | Reference | Comment |
---|---|---|---|---|---|
ΔrH° | 56.9 | kcal/mol | PDiss | Tecklenberg, Bricker, et al., 1988 | gas phase; ΔrH<; M |
By formula: (Fe+ • 10Fe) + Fe = (Fe+ • 11Fe)
Enthalpy of reaction
ΔrH° (kcal/mol) | T (K) | Method | Reference | Comment |
---|---|---|---|---|
79.8 | CID | Armentrout and Kickel, 1994 | gas phase; guided ion beam CID; M |
By formula: (Fe+ • 11Fe) + Fe = (Fe+ • 12Fe)
Enthalpy of reaction
ΔrH° (kcal/mol) | T (K) | Method | Reference | Comment |
---|---|---|---|---|
97.5 | CID | Armentrout and Kickel, 1994 | gas phase; guided ion beam CID; M |
By formula: (Fe+ • 12Fe) + Fe = (Fe+ • 13Fe)
Enthalpy of reaction
ΔrH° (kcal/mol) | T (K) | Method | Reference | Comment |
---|---|---|---|---|
67.2 | CID | Armentrout and Kickel, 1994 | gas phase; guided ion beam CID; M |
By formula: (Fe+ • 13Fe) + Fe = (Fe+ • 14Fe)
Enthalpy of reaction
ΔrH° (kcal/mol) | T (K) | Method | Reference | Comment |
---|---|---|---|---|
90.1 | CID | Armentrout and Kickel, 1994 | gas phase; guided ion beam CID; M |
By formula: (Fe+ • 14Fe) + Fe = (Fe+ • 15Fe)
Enthalpy of reaction
ΔrH° (kcal/mol) | T (K) | Method | Reference | Comment |
---|---|---|---|---|
76.2 | CID | Armentrout and Kickel, 1994 | gas phase; guided ion beam CID; M |
By formula: (Fe+ • 15Fe) + Fe = (Fe+ • 16Fe)
Enthalpy of reaction
ΔrH° (kcal/mol) | T (K) | Method | Reference | Comment |
---|---|---|---|---|
77.2 | CID | Armentrout and Kickel, 1994 | gas phase; guided ion beam CID; M |
By formula: (Fe+ • 16Fe) + Fe = (Fe+ • 17Fe)
Enthalpy of reaction
ΔrH° (kcal/mol) | T (K) | Method | Reference | Comment |
---|---|---|---|---|
74.3 | CID | Armentrout and Kickel, 1994 | gas phase; guided ion beam CID; M |
By formula: (Fe+ • 17Fe) + Fe = (Fe+ • 18Fe)
Enthalpy of reaction
ΔrH° (kcal/mol) | T (K) | Method | Reference | Comment |
---|---|---|---|---|
89.1 | CID | Armentrout and Kickel, 1994 | gas phase; guided ion beam CID; M |
By formula: (Fe+ • 9Fe) + Fe = (Fe+ • 10Fe)
Enthalpy of reaction
ΔrH° (kcal/mol) | T (K) | Method | Reference | Comment |
---|---|---|---|---|
73.6 | CID | Armentrout and Kickel, 1994 | gas phase; guided ion beam CID; M |
By formula: (Fe+ • 3Fe) + Fe = (Fe+ • 4Fe)
Enthalpy of reaction
ΔrH° (kcal/mol) | T (K) | Method | Reference | Comment |
---|---|---|---|---|
62.1 | CID | Armentrout and Kickel, 1994 | gas phase; guided ion beam CID; M |
By formula: (Fe+ • 4Fe) + Fe = (Fe+ • 5Fe)
Enthalpy of reaction
ΔrH° (kcal/mol) | T (K) | Method | Reference | Comment |
---|---|---|---|---|
75.3 | CID | Armentrout and Kickel, 1994 | gas phase; guided ion beam CID; M |
By formula: (Fe+ • 5Fe) + Fe = (Fe+ • 6Fe)
Enthalpy of reaction
ΔrH° (kcal/mol) | T (K) | Method | Reference | Comment |
---|---|---|---|---|
76.5 | CID | Armentrout and Kickel, 1994 | gas phase; guided ion beam CID; M |
By formula: (Fe+ • 6Fe) + Fe = (Fe+ • 7Fe)
Enthalpy of reaction
ΔrH° (kcal/mol) | T (K) | Method | Reference | Comment |
---|---|---|---|---|
60.2 | CID | Armentrout and Kickel, 1994 | gas phase; guided ion beam CID; M |
By formula: (Fe+ • 7Fe) + Fe = (Fe+ • 8Fe)
Enthalpy of reaction
ΔrH° (kcal/mol) | T (K) | Method | Reference | Comment |
---|---|---|---|---|
67.2 | CID | Armentrout and Kickel, 1994 | gas phase; guided ion beam CID; M |
By formula: (Fe+ • 8Fe) + Fe = (Fe+ • 9Fe)
Enthalpy of reaction
ΔrH° (kcal/mol) | T (K) | Method | Reference | Comment |
---|---|---|---|---|
67.9 | CID | Armentrout and Kickel, 1994 | gas phase; guided ion beam CID; M |
By formula: (Fe+ • Fe) + CO = (Fe+ • CO • Fe)
Quantity | Value | Units | Method | Reference | Comment |
---|---|---|---|---|---|
ΔrH° | 58.6 | kcal/mol | PDiss | Tecklenberg, Bricker, et al., 1988 | gas phase; ΔrH<; M |
(CAS Reg. No. 64899-88-3 • 4294967295) +
= CAS Reg. No. 64899-88-3
By formula: (CAS Reg. No. 64899-88-3 • 4294967295Fe) + Fe = CAS Reg. No. 64899-88-3
Quantity | Value | Units | Method | Reference | Comment |
---|---|---|---|---|---|
ΔrH° | 43.1 ± 7.0 | kcal/mol | N/A | Stevens, Feigerle, et al., 1983 | gas phase; B |
C12FeO12Ru2 (cr) = 12 (g) +
(cr) + 2
(cr)
By formula: C12FeO12Ru2 (cr) = 12CO (g) + Fe (cr) + 2Ru (cr)
Quantity | Value | Units | Method | Reference | Comment |
---|---|---|---|---|---|
ΔrH° | 135. ± 2.4 | kcal/mol | TD-HFC | Baev, Connor, et al., 1981 | MS |
C12Fe2O12Ru (cr) = 12 (g) + 2
(cr) +
(cr)
By formula: C12Fe2O12Ru (cr) = 12CO (g) + 2Fe (cr) + Ru (cr)
Quantity | Value | Units | Method | Reference | Comment |
---|---|---|---|---|---|
ΔrH° | 118. ± 2. | kcal/mol | TD-HFC | Baev, Connor, et al., 1981 | MS |

Ion clustering data

Data compiled as indicated in comments:
M - Michael M. Meot-Ner (Mautner) and Sharon G. Lias
B - John E. Bartmess
Clustering reactions
By formula: Fe+ + Fe = (Fe+ • Fe)
Quantity | Value | Units | Method | Reference | Comment |
---|---|---|---|---|---|
ΔrH° | 62. | kcal/mol | CID | Loh, Lian, et al., 1988 | gas phase; M |
ΔrH° | 62.4 | kcal/mol | PDiss | Tecklenberg, Bricker, et al., 1988 | gas phase; ΔrH>; M |
Enthalpy of reaction
ΔrH° (kcal/mol) | T (K) | Method | Reference | Comment |
---|---|---|---|---|
64.1 | CID | Armentrout and Kickel, 1994 | gas phase; guided ion beam CID; M |
By formula: (Fe+ • Fe) + Fe = (Fe+ • 2Fe)
Quantity | Value | Units | Method | Reference | Comment |
---|---|---|---|---|---|
ΔrH° | 55.6 | kcal/mol | PDiss | Tecklenberg, Bricker, et al., 1988 | gas phase; ΔrH<; M |
Enthalpy of reaction
ΔrH° (kcal/mol) | T (K) | Method | Reference | Comment |
---|---|---|---|---|
40.4 | CID | Armentrout and Kickel, 1994 | gas phase; guided ion beam CID; M |
By formula: (Fe+ • 2Fe) + Fe = (Fe+ • 3Fe)
Quantity | Value | Units | Method | Reference | Comment |
---|---|---|---|---|---|
ΔrH° | 41.5 | kcal/mol | CID | Loh, Lian, et al., 1988 | gas phase; M |
Enthalpy of reaction
ΔrH° (kcal/mol) | T (K) | Method | Reference | Comment |
---|---|---|---|---|
51.6 | CID | Armentrout and Kickel, 1994 | gas phase; guided ion beam CID; M |
By formula: (Fe+ • 3Fe) + Fe = (Fe+ • 4Fe)
Enthalpy of reaction
ΔrH° (kcal/mol) | T (K) | Method | Reference | Comment |
---|---|---|---|---|
62.1 | CID | Armentrout and Kickel, 1994 | gas phase; guided ion beam CID; M |
By formula: (Fe+ • 4Fe) + Fe = (Fe+ • 5Fe)
Enthalpy of reaction
ΔrH° (kcal/mol) | T (K) | Method | Reference | Comment |
---|---|---|---|---|
75.3 | CID | Armentrout and Kickel, 1994 | gas phase; guided ion beam CID; M |
By formula: (Fe+ • 5Fe) + Fe = (Fe+ • 6Fe)
Enthalpy of reaction
ΔrH° (kcal/mol) | T (K) | Method | Reference | Comment |
---|---|---|---|---|
76.5 | CID | Armentrout and Kickel, 1994 | gas phase; guided ion beam CID; M |
By formula: (Fe+ • 6Fe) + Fe = (Fe+ • 7Fe)
Enthalpy of reaction
ΔrH° (kcal/mol) | T (K) | Method | Reference | Comment |
---|---|---|---|---|
60.2 | CID | Armentrout and Kickel, 1994 | gas phase; guided ion beam CID; M |
By formula: (Fe+ • 7Fe) + Fe = (Fe+ • 8Fe)
Enthalpy of reaction
ΔrH° (kcal/mol) | T (K) | Method | Reference | Comment |
---|---|---|---|---|
67.2 | CID | Armentrout and Kickel, 1994 | gas phase; guided ion beam CID; M |
By formula: (Fe+ • 8Fe) + Fe = (Fe+ • 9Fe)
Enthalpy of reaction
ΔrH° (kcal/mol) | T (K) | Method | Reference | Comment |
---|---|---|---|---|
67.9 | CID | Armentrout and Kickel, 1994 | gas phase; guided ion beam CID; M |
By formula: (Fe+ • 9Fe) + Fe = (Fe+ • 10Fe)
Enthalpy of reaction
ΔrH° (kcal/mol) | T (K) | Method | Reference | Comment |
---|---|---|---|---|
73.6 | CID | Armentrout and Kickel, 1994 | gas phase; guided ion beam CID; M |
By formula: (Fe+ • 10Fe) + Fe = (Fe+ • 11Fe)
Enthalpy of reaction
ΔrH° (kcal/mol) | T (K) | Method | Reference | Comment |
---|---|---|---|---|
79.8 | CID | Armentrout and Kickel, 1994 | gas phase; guided ion beam CID; M |
By formula: (Fe+ • 11Fe) + Fe = (Fe+ • 12Fe)
Enthalpy of reaction
ΔrH° (kcal/mol) | T (K) | Method | Reference | Comment |
---|---|---|---|---|
97.5 | CID | Armentrout and Kickel, 1994 | gas phase; guided ion beam CID; M |
By formula: (Fe+ • 12Fe) + Fe = (Fe+ • 13Fe)
Enthalpy of reaction
ΔrH° (kcal/mol) | T (K) | Method | Reference | Comment |
---|---|---|---|---|
67.2 | CID | Armentrout and Kickel, 1994 | gas phase; guided ion beam CID; M |
By formula: (Fe+ • 13Fe) + Fe = (Fe+ • 14Fe)
Enthalpy of reaction
ΔrH° (kcal/mol) | T (K) | Method | Reference | Comment |
---|---|---|---|---|
90.1 | CID | Armentrout and Kickel, 1994 | gas phase; guided ion beam CID; M |
By formula: (Fe+ • 14Fe) + Fe = (Fe+ • 15Fe)
Enthalpy of reaction
ΔrH° (kcal/mol) | T (K) | Method | Reference | Comment |
---|---|---|---|---|
76.2 | CID | Armentrout and Kickel, 1994 | gas phase; guided ion beam CID; M |
By formula: (Fe+ • 15Fe) + Fe = (Fe+ • 16Fe)
Enthalpy of reaction
ΔrH° (kcal/mol) | T (K) | Method | Reference | Comment |
---|---|---|---|---|
77.2 | CID | Armentrout and Kickel, 1994 | gas phase; guided ion beam CID; M |
By formula: (Fe+ • 16Fe) + Fe = (Fe+ • 17Fe)
Enthalpy of reaction
ΔrH° (kcal/mol) | T (K) | Method | Reference | Comment |
---|---|---|---|---|
74.3 | CID | Armentrout and Kickel, 1994 | gas phase; guided ion beam CID; M |
By formula: (Fe+ • 17Fe) + Fe = (Fe+ • 18Fe)
Enthalpy of reaction
ΔrH° (kcal/mol) | T (K) | Method | Reference | Comment |
---|---|---|---|---|
89.1 | CID | Armentrout and Kickel, 1994 | gas phase; guided ion beam CID; M |
By formula: (FeO- • 4294967295Fe) + Fe = FeO-
Quantity | Value | Units | Method | Reference | Comment |
---|---|---|---|---|---|
ΔrH° | 94.3 ± 4.0 | kcal/mol | N/A | Drechsler, Boesl, et al., 1997 | gas phase; B |
ΔrH° | 94.3 ± 7.0 | kcal/mol | Ther | Engelking and Lineberger, 1977 | gas phase; B |

References

Chase, 1998
Chase, M.W., Jr.,
NIST-JANAF Themochemical Tables, Fourth Edition,
J. Phys. Chem. Ref. Data, Monograph 9, 1998, 1-1951. [all data]
Hunter and Lias, 1998
Hunter, E.P.; Lias, S.G.,
Evaluated Gas Phase Basicities and Proton Affinities of Molecules: An Update,
J. Phys. Chem. Ref. Data, 1998, 27, 3, 413-656, https://doi.org/10.1063/1.556018
. [all data]
Miller, Miller, et al., 1993
Miller, A.E.S.; Miller, T.M.; Morris, R.A.; Viggiano, A.A.; Vandoren, J.M.; Paulson, J.F.,
Reactions of Fe- with Acids - Gas-Phase Acidity and Bond Energy of FeH,
Int. J. Mass Spectrom. Ion Proc., 1993, 123, 3, 205, https://doi.org/10.1016/0168-1176(93)87099-E
. [all data]
Leopold and Lineberger, 1986
Leopold, D.G.; Lineberger, W.C.,
A study of the low-lying electronic states of Fe2 and Co2 by negative ion photoelectron spectroscopy,
J. Chem. Phys., 1986, 85, 51. [all data]
Engelking and Lineberger, 1979
Engelking, P.C.; Lineberger, W.C.,
Laser Photoelectron Spectroscopy of Fe-: the Electron Affinity of Iron and the Nonstatistical Fine Structure Detachment Intensities at 488 nm,
Phys. Rev. A, 1979, 19, 1, 149, https://doi.org/10.1103/PhysRevA.19.149
. [all data]
Engelking and Lineberger, 1976
Engelking, P.C.; Lineberger, W.C.,
Electron Affinity of Atomic Iron and Some Iron Compounds Mearsured by Photoelectron Spectroscopy,
Bull. Am. Phys. Soc., 1976, 21, 1263. [all data]
Compton and Stockdale, 1976
Compton, R.N.; Stockdale, J.A.D.,
Formation of gas phase negative ions in Fe(CO)5 and Ni(CO)4,
Int. J. Mass Spectrom. Ion Phys., 1976, 22, 47. [all data]
Russell, Solouki, et al., 1995
Russell, D.H.; Solouki, T.; Oriedo, J.V.B.,
Collisional relaxation of metastable electronic states of Fe+,
J. Am. Soc. Mass Spectrom., 1995, 6, 543. [all data]
Lide, 1992
Lide, D.R. (Editor),
Ionization potentials of atoms and atomic ions
in Handbook of Chem. and Phys., 1992, 10-211. [all data]
Kelly, 1987
Kelly, R.L.,
Atomic and ionic spectrum lines of hydrogen through kryton,
J. Phys. Chem. Ref. Data, 1987, 16. [all data]
Sugar and Corliss, 1985
Sugar, J.; Corliss, C.,
Atomic energy levels of the iron period elements: Potassium through nickel,
J. Phys. Chem. Ref. Data, 1985, 14. [all data]
Dyke, Gravenor, et al., 1982
Dyke, J.M.; Gravenor, B.W.J.; Lewis, R.A.; Morris, A.,
Gas-phase high temperature photoelectron spectroscopy: An investigation of the transition metals iron, cobalt, and nickel,
J. Phys. B:, 1982, 15, 4523. [all data]
Clements and Sale, 1976
Clements, P.J.; Sale, F.R.,
A mass spectrometric study of nickel tetracarbonyl, iron pentacarbonyl and binary mixtures of these compounds,
Metall. Trans. B:, 1976, 7, 171. [all data]
Hildenbrand, 1975
Hildenbrand, D.L.,
Thermochemistry of molecular FeO, FeO+ and FeO2,
Chem. Phys. Lett., 1975, 34, 352. [all data]
Moore, 1970
Moore, C.E.,
Ionization potentials and ionization limits derived from the analyses of optical spectra,
Natl. Stand. Ref. Data Ser., (U.S. Natl. Bur. Stand.), 1970, 34, 1. [all data]