5-Decene, (E)-
- Formula: C10H20
- Molecular weight: 140.2658
- IUPAC Standard InChIKey: UURSXESKOOOTOV-MDZDMXLPSA-N
- CAS Registry Number: 7433-56-9
- Chemical structure:
View 3d structure (requires JavaScript / HTML 5) - Stereoisomers:
- Other names: (E)-5-Decene; trans-5-Decene; ε-trans-Decene; 5-trans-Decene; (E)-5-C10H20; trans-dec-5-ene

Phase change data

Data compiled as indicated in comments:
BS - Robert L. Brown and Stephen E. Stein
TRC - Thermodynamics Research Center, NIST Boulder Laboratories, Chris Muzny director
AC - William E. Acree, Jr., James S. Chickos
Quantity | Value | Units | Method | Reference | Comment |
---|---|---|---|---|---|
Tboil | 445. | K | N/A | Farchan Laboratories, 1990 | BS |
Quantity | Value | Units | Method | Reference | Comment |
Tfus | 201. | K | N/A | Benkeser, Schroll, et al., 1955 | Uncertainty assigned by TRC = 3. K; TRC |
Tfus | 202. | K | N/A | Benkeser, Schroll, et al., 1955 | Uncertainty assigned by TRC = 2. K; TRC |
Tfus | 200. | K | N/A | Campbell and Eby, 1941 | Uncertainty assigned by TRC = 1. K; TRC |
Tfus | 200.15 | K | N/A | Campbell and Eby, 1941, 2 | Uncertainty assigned by TRC = 1.5 K; TRC |
Reduced pressure boiling point
Tboil (K) | Pressure (bar) | Reference | Comment |
---|---|---|---|
443.2 | 1.00 | Aldrich Chemical Company Inc., 1990 | BS |
Enthalpy of vaporization
ΔvapH (kJ/mol) | Temperature (K) | Method | Reference | Comment |
---|---|---|---|---|
42.3 | 413. | A | Stephenson and Malanowski, 1987 | Based on data from 398. to 444. K.; AC |

Gas phase ion energetics data

Data compiled as indicated in comments:
LLK - Sharon G. Lias, Rhoda D. Levin, and Sherif A. Kafafi
Ionization energy determinations
IE (eV) | Method | Reference | Comment |
---|---|---|---|
8.762 ± 0.012 | PI | Rang, Martinson, et al., 1974 | LLK |
8.760 ± 0.005 | PE | Masclet, Grosjean, et al., 1973 | LLK |
8.95 ± 0.01 | PE | Krause, Taylor, et al., 1978 | Vertical value; LLK |

Kovats' RI, polar column, isothermal

Data compiled by: NIST Mass Spectrometry Data Center, William E. Wallace, director

Column type CapillaryCapillaryCapillaryCapillaryCapillary
Active phase PEG 4000PEG 4000PEG 4000PEG 4000PEG 4000
Column length (m)
Carrier gas
Substrate
Column diameter (mm)
Phase thickness (μm)
Temperature (C) 100.110.120.70.80.
I 1041.1042.1043.1039.1040.
ReferenceRang, Orav, et al., 1988Rang, Orav, et al., 1988Rang, Orav, et al., 1988Rang, Orav, et al., 1988Rang, Orav, et al., 1988
Comment MSDC-RI MSDC-RI MSDC-RI MSDC-RI MSDC-RI
Column type CapillaryCapillaryCapillaryCapillaryCapillary
Active phase PEG-20MPEG-20MPEG-20MPolyethylene Glycol 4000Polyethylene Glycol 4000
Column length (m)    80.80.
Carrier gas
Substrate
Column diameter (mm)    0.250.25
Phase thickness (μm)
Temperature (C) 100.110.90.100.120.
I 1037.1038.1037.1040.71042.6
ReferenceRang, Orav, et al., 1988Rang, Orav, et al., 1988Rang, Orav, et al., 1988Eisen, Orav, et al., 1972Eisen, Orav, et al., 1972
Comment MSDC-RI MSDC-RI MSDC-RI MSDC-RI MSDC-RI
Column type CapillaryCapillaryCapillaryCapillaryCapillary
Active phase Polyethylene Glycol 4000Polyethylene Glycol 4000PEG 4000PEG 4000PEG 4000
Column length (m) 80.80.80.80.80.
Carrier gas
Substrate
Column diameter (mm) 0.250.250.250.250.25
Phase thickness (μm)
Temperature (C) 70.80.100.120.70.
I 1038.71040.41040.71042.61038.7
ReferenceEisen, Orav, et al., 1972Eisen, Orav, et al., 1972Orav and Eisen, 1972Orav and Eisen, 1972Orav and Eisen, 1972
Comment MSDC-RI MSDC-RI MSDC-RI MSDC-RI MSDC-RI
Column type Capillary
Active phase PEG 4000
Column length (m) 80.
Carrier gas
Substrate
Column diameter (mm) 0.25
Phase thickness (μm)
Temperature (C) 80.
I 1040.4
ReferenceOrav and Eisen, 1972
Comment MSDC-RI

Normal alkane RI, non-polar column, custom temperature program

Data compiled by: NIST Mass Spectrometry Data Center, William E. Wallace, director

Column type CapillaryCapillary
Active phase Polydimethyl siloxaneOV-1, SE-30, Methyl silicone, SP-2100, OV-101, DB-1, etc.
Column length (m)  50.
Carrier gas  Hydrogen
Substrate
Column diameter (mm)  0.32
Phase thickness (μm)
Program not specifiednot specified
I 984.1000.
ReferenceJunkes, Castanho, et al., 2003Waggott and Davies, 1984
Comment MSDC-RI MSDC-RI

References

Farchan Laboratories, 1990
Farchan Laboratories,
Research Chemicals Catalog, Farchan Laboratories, Gainesville, FL, 1990, 91. [all data]
Benkeser, Schroll, et al., 1955
Benkeser, R.A.; Schroll, G.; Sauve, D.M.,
J. Am. Chem. Soc., 1955, 77, 3378. [all data]
Campbell and Eby, 1941
Campbell, K.N.; Eby, L.T.,
The preparation of higher cis and trans olefins,
J. Am. Chem. Soc., 1941, 63, 216. [all data]
Campbell and Eby, 1941, 2
Campbell, K.N.; Eby, L.T.,
The Reduction of Multiple Carbon-Carbon Bonds III. Further Studies on the Preparation of Olefins from Acetylenes,
J. Am. Chem. Soc., 1941, 63, 2683. [all data]
Aldrich Chemical Company Inc., 1990
Aldrich Chemical Company Inc.,
Catalog Handbook of Fine Chemicals, Aldrich Chemical Company, Inc., Milwaukee WI, 1990, 1. [all data]
Stephenson and Malanowski, 1987
Stephenson, Richard M.; Malanowski, Stanislaw,
Handbook of the Thermodynamics of Organic Compounds, 1987, https://doi.org/10.1007/978-94-009-3173-2
. [all data]
Rang, Martinson, et al., 1974
Rang, S.; Martinson, E.; Muurisepp, M.,
Ionization potentials of unsaturated hydrocarbons. 1. n-Alkenes, Eesti NSV Teaduste Akadeemia Toimetised 23,
Eesti. NSV Tead. Akad. Toim., 1974, 352. [all data]
Masclet, Grosjean, et al., 1973
Masclet, P.; Grosjean, D.; Mouvier, G.,
Alkene ionization potentials. Part I. Quantitative determination of alkyl group structural effects,
J. Electron Spectrosc. Relat. Phenom., 1973, 2, 225. [all data]
Krause, Taylor, et al., 1978
Krause, D.A.; Taylor, J.W.; Fenske, R.F.,
An analysis of the effects of alkyl substituents on the ionization potentials of n-alkenes,
J. Am. Chem. Soc., 1978, 100, 718. [all data]