Cyclohexanol, 2-methoxy-, (1R,2R)-rel-
- Formula: C7H14O2
- Molecular weight: 130.1849
- IUPAC Standard InChIKey: DCQQZLGQRIVCNH-BQBZGAKWSA-N
- CAS Registry Number: 7429-40-5
- Chemical structure:
View 3d structure (requires JavaScript / HTML 5) - Stereoisomers:
- Other names: Cyclohexanol,2-methoxy-,trans-

Gas phase ion energetics data

Data compiled by: Sharon G. Lias, Rhoda D. Levin, and Sherif A. Kafafi
Ionization energy determinations
IE (eV) | Method | Reference | Comment |
---|---|---|---|
9.69 | PE | Brown, 1976 | Vertical value |

References

Brown, 1976
Brown, R.S.,
Application of photoelectron spectroscopy to intramolecularly hydrogen-bonded systems. Part III. The photoelectron spectra of cis and trans 2-substituted cyclopentanols cis and trans 2-substituted cyclohexanols,
Can. J. Chem., 1976, 54, 1929. [all data]