Cyclohexane,1,2-dibromo-,trans-
- Formula: C6H10Br2
- Molecular weight: 241.952
- IUPAC Standard InChIKey: CZNHKZKWKJNOTE-WDSKDSINSA-N
- CAS Registry Number: 7429-37-0
- Chemical structure:
View 3d structure (requires JavaScript / HTML 5) - Stereoisomers:
- Other names: trans-1,2-Dibromocyclohexane; .+/-.-trans-1,2-Dibromocyclohexane

Phase change data

Data compiled as indicated in comments:
BS - Robert L. Brown and Stephen E. Stein
ALS - Hussein Y. Afeefy, Joel F. Liebman, and Stephen E. Stein
AC - William E. Acree, Jr., James S. Chickos
Quantity | Value | Units | Method | Reference | Comment |
---|---|---|---|---|---|
ΔvapH° | 50.497 | kJ/mol | V | Lister, 1941 | ALS |
Reduced pressure boiling point
Tboil (K) | Pressure (bar) | Reference | Comment |
---|---|---|---|
418.2 | 0.133 | Aldrich Chemical Company Inc., 1990 | BS |
372. to 376. | 0.021 | Frinton Laboratories Inc., 1986 | BS |
Enthalpy of vaporization
ΔvapH (kJ/mol) | Temperature (K) | Method | Reference | Comment |
---|---|---|---|---|
53.3 | 365. | A | Stephenson and Malanowski, 1987 | Based on data from 350. to 416. K.; AC |

Gas phase ion energetics data

Data compiled as indicated in comments:
LLK - Sharon G. Lias, Rhoda D. Levin, and Sherif A. Kafafi
Ionization energy determinations
IE (eV) | Method | Reference | Comment |
---|---|---|---|
10.02 ± 0.02 | PE | Botter, Menes, et al., 1973 | LLK |
10.06 ± 0.01 | PE | Chau and McDowell, 1976 | Vertical value; LLK |

References

Lister, 1941
Lister, M.W.,
Heats of organic reactions. X. Heats of bromination of cyclic olefins,
J. Am. Chem. Soc., 1941, 63, 143-149. [all data]
Aldrich Chemical Company Inc., 1990
Aldrich Chemical Company Inc.,
Catalog Handbook of Fine Chemicals, Aldrich Chemical Company, Inc., Milwaukee WI, 1990, 1. [all data]
Frinton Laboratories Inc., 1986
Frinton Laboratories Inc.,
Catalog Number 11, Frinton Laboratories Inc., Vineland, NJ, 1986, 99. [all data]
Stephenson and Malanowski, 1987
Stephenson, Richard M.; Malanowski, Stanislaw,
Handbook of the Thermodynamics of Organic Compounds, 1987, https://doi.org/10.1007/978-94-009-3173-2
. [all data]
Botter, Menes, et al., 1973
Botter, R.; Menes, F.; Gounelle, Y.; Pechine, J.M.; Solgadi, D.,
The ionization potentials of geometrical isomers: the cis and trans 2-subststituted cyclopentyl and cyclohexyl bromides,
Int. J. Mass Spectrom. Ion Phys., 1973, 12, 188. [all data]
Chau and McDowell, 1976
Chau, F.T.; McDowell, C.A.,
The HeI photoelectron spectrum of trans-1,2-dibromocyclohexane,
J. Mol. Struct., 1976, 34, 93. [all data]