Hydrazine, 1,1-dibutyl-
- Formula: C8H20N2
- Molecular weight: 144.2578
- IUPAC Standard InChIKey: DJTIANXYHUNHQV-UHFFFAOYSA-N
- CAS Registry Number: 7422-80-2
- Chemical structure:
View 3d structure (requires JavaScript / HTML 5) - Other names: N,N-Dibutylhydrazine; 1,1-Dibutylhydrazine; 1,1-DBH; 1,1-Di-n-butylhydrazine

Gas phase ion energetics data

Data compiled as indicated in comments:
LLK - Sharon G. Lias, Rhoda D. Levin, and Sherif A. Kafafi
RDSH - Henry M. Rosenstock, Keith Draxl, Bruce W. Steiner, and John T. Herron
Ionization energy determinations
IE (eV) | Method | Reference | Comment |
---|---|---|---|
7.47 ± 0.05 | PI | Akopyan, Vilesov, et al., 1963 | RDSH |
7.75 ± 0.05 | PE | Vovna, Vilesov, et al., 1975 | Vertical value; LLK |

References

Akopyan, Vilesov, et al., 1963
Akopyan, M.E.; Vilesov, F.I.; Terenin, A.N.,
Mass spectrometric investigation of photoionization of molecules and dissociation of excited molecular ions,
Izv. Akad. Nauk SSSR, Ser. Fiz., 1963, 27, 1083, In original 1054. [all data]
Vovna, Vilesov, et al., 1975
Vovna, V.I.; Vilesov, F.I.; Lopatin, S.N.,
Photoelectron spectra of hydrazine and some alkyl derivatives,
Opt. Spectrosc., 1975, 38, 143. [all data]