3-methylpenta-1,2-diene
- Formula: C6H10
- Molecular weight: 82.1436
- IUPAC Standard InChIKey: INFFCVIZNSUFGK-UHFFFAOYSA-N
- CAS Registry Number: 7417-48-3
- Chemical structure:
View 3d structure (requires JavaScript / HTML 5) - Other names: 1,2-Pentadiene, 3-methyl-

Gas phase ion energetics data

Data compiled as indicated in comments:
LLK - Sharon G. Lias, Rhoda D. Levin, and Sherif A. Kafafi
Ionization energy determinations
IE (eV) | Method | Reference | Comment |
---|---|---|---|
8.74 ± 0.05 | EI | Wolkoff, Holmes, et al., 1980 | LLK |
Appearance energy determinations
Ion | AE (eV) | Other Products | Method | Reference | Comment |
---|---|---|---|---|---|
C5H7+ | 9.44 ± 0.05 | CH3 | EI | Wolkoff, Holmes, et al., 1980 | LLK |

References

Wolkoff, Holmes, et al., 1980
Wolkoff, P.; Holmes, J.L.; Lossing, F.P.,
On the formation of cyclopentenium cations from all C6H10+ molecular ion structures,
Can. J. Chem., 1980, 58, 251. [all data]