Benzene, (3-ethyl-1-pentynyl)-
- Formula: C13H16
- Molecular weight: 172.2661
- IUPAC Standard InChIKey: WJQBALSWJCYVQH-UHFFFAOYSA-N
- CAS Registry Number: 73829-94-4
- Chemical structure:
View 3d structure (requires JavaScript / HTML 5) - Permanent link for this species. Use this link for bookmarking this species for future reference.

Gas phase ion energetics data

Data compiled as indicated in comments:
LLK - Sharon G. Lias, Rhoda D. Levin, and Sherif A. Kafafi
Ionization energy determinations
IE (eV) | Method | Reference | Comment |
---|---|---|---|
8.24 ± 0.08 | PE | Elbel, Lienert, et al., 1981 | LLK |

References

Elbel, Lienert, et al., 1981
Elbel, S.; Lienert, K.; Krebs, A.; tom Dieck, H.,
Phenylethin - mustersonde fur substituenteneffekte,
Liebigs Ann. Chem., 1981, 1785. [all data]