Boranamine, 1,1-dibromo-N,N-dimethyl-
- Formula: C2H6BBr2N
- Molecular weight: 214.695
- IUPAC Standard InChIKey: KCVBPATYWJESTP-UHFFFAOYSA-N
- CAS Registry Number: 7360-64-7
- Chemical structure:
View 3d structure (requires JavaScript / HTML 5) - Permanent link for this species. Use this link for bookmarking this species for future reference.

Gas phase ion energetics data

Data compiled as indicated in comments:
LLK - Sharon G. Lias, Rhoda D. Levin, and Sherif A. Kafafi
RDSH - Henry M. Rosenstock, Keith Draxl, Bruce W. Steiner, and John T. Herron
Ionization energy determinations
IE (eV) | Method | Reference | Comment |
---|---|---|---|
9.60 | PE | Bock and Fuss, 1971 | LLK |
9.50 | EI | Lappert, Litzow, et al., 1970 | RDSH |
9.55 | PE | King, Krishnamurthy, et al., 1972 | Vertical value; LLK |

References

Bock and Fuss, 1971
Bock, H.; Fuss, W.,
Ionisierungsenergien und geometrie von aminoboranen,
Chem. Ber., 1971, 104, 1687. [all data]
Lappert, Litzow, et al., 1970
Lappert, M.F.; Litzow, M.R.; Pedley, J.B.; Riley, P.N.K.; Spalding, T.R.; Tweedale, A.,
Bonding studies of compounds of boron and the group IV elements. Part III.First ionisation potentials of some simple boron compounds by electron impact and by a new empirical molecular orbital method,
J. Chem. Soc. A, 1970, 2320. [all data]
King, Krishnamurthy, et al., 1972
King, G.H.; Krishnamurthy, S.S.; Lappert, M.F.; Pedley, J.B.,
Bonding studies of compounds of boron and the Group 4 elements. Part 9. Photoelectron spectra and bonding studies of halogeno-, dimethylamino-, and methyl-boranes, BX3 and BX2Y,
Faraday Discuss. Chem. Soc., 1972, 54, 70. [all data]