Benzenamine,4-[2-(4-nitrophenyl)ethyl]-
- Formula: C14H14N2O2
- Molecular weight: 242.2732
- IUPAC Standard InChIKey: LJMZVVZWVDMYLW-UHFFFAOYSA-N
- CAS Registry Number: 7357-96-2
- Chemical structure:
View 3d structure (requires JavaScript / HTML 5) - Permanent link for this species. Use this link for bookmarking this species for future reference.

Gas phase ion energetics data

Data compiled as indicated in comments:
LLK - Sharon G. Lias, Rhoda D. Levin, and Sherif A. Kafafi
RDSH - Henry M. Rosenstock, Keith Draxl, Bruce W. Steiner, and John T. Herron
Ionization energy determinations
IE (eV) | Method | Reference | Comment |
---|---|---|---|
7.78 ± 0.05 | EI | Pignataro, Mancini, et al., 1972 | LLK |
7.8 ± 0.1 | EI | McLafferty, Wachs, et al., 1970 | RDSH |
Appearance energy determinations
Ion | AE (eV) | Other Products | Method | Reference | Comment |
---|---|---|---|---|---|
C7H6NO2+ | ~15. | ? | EI | McLafferty, Wachs, et al., 1970 | RDSH |
C7H8N+ | 9.2 ± 0.2 | ? | EI | McLafferty, Wachs, et al., 1970 | RDSH |

References

Pignataro, Mancini, et al., 1972
Pignataro, S.; Mancini, V.; Innorta, G.; Distefano, G.,
Ionization energies and ring orbital interaction in diarylmethanes and diaryleth,
Z. Naturforsch., 1972, 27, 534. [all data]
McLafferty, Wachs, et al., 1970
McLafferty, F.W.; Wachs, T.; Lifshitz, C.; Innorta, G.; Irving, P.,
Substituent effects in unimolecular ion decompositions. XV. Mechanistic interpretations and the quasi-equilibrium theory,
J. Am. Chem. Soc., 1970, 92, 6867. [all data]