1H-Pyridazino[1,2-c][1,3,4]oxadiazine,hexahydro-
- Formula: C7H14N2O
- Molecular weight: 142.1989
- IUPAC Standard InChIKey: BNPPBSQGZUMICD-UHFFFAOYSA-N
- CAS Registry Number: 73569-74-1
- Chemical structure:
View 3d structure (requires JavaScript / HTML 5) - Permanent link for this species. Use this link for bookmarking this species for future reference.

Gas phase ion energetics data

Data compiled by: Sharon G. Lias, Rhoda D. Levin, and Sherif A. Kafafi
Ionization energy determinations
IE (eV) | Method | Reference | Comment |
---|---|---|---|
8.04 | PE | Katritzky, Baker, et al., 1980 | Vertical value |

References

Katritzky, Baker, et al., 1980
Katritzky, A.R.; Baker, V.J.; Brito-Palma, F.M.S.; Patel, R.C.; Pfister-Guillouzo, G.; Guimon, C.,
Conformational analysis of saturated J. Heterocycl. Chem.. Part 94. Applications of photoelectron spectroscopy to molecular properties. Part 3. Photoelectron spectroscopic studies of some 1-oxa-3,4-diaza-, 1-thia-3,4-diaza-, 1,2,4-triaza-, and 1,2,4,5-tetraaza-cyclohexanes,.,
J. Chem. Soc. Perkin Trans. 2, 1980, 91. [all data]