Bis(difluoromethyl)(trifluoromethyl)amine
- Formula: C3H2F7N
- Molecular weight: 185.0435
- IUPAC Standard InChIKey: HEDJVTPVXXGOFE-UHFFFAOYSA-N
- CAS Registry Number: 73551-02-7
- Chemical structure:
View 3d structure (requires JavaScript / HTML 5) - Permanent link for this species. Use this link for bookmarking this species for future reference.

Gas phase ion energetics data

Data compiled as indicated in comments:
LBLHLM - Sharon G. Lias, John E. Bartmess, Joel F. Liebman, John L. Holmes, Rhoda D. Levin, and W. Gary Mallard
Ionization energy determinations
IE (eV) | Method | Reference | Comment |
---|---|---|---|
11.4 | PE | Burger, Pawelke, et al., 1982 | LBLHLM |
12.08 | PE | Burger, Pawelke, et al., 1982 | Vertical value; LBLHLM |

References

Burger, Pawelke, et al., 1982
Burger, H.; Pawelke, G.; Dammel, R.; Bock, H.,
Effects of fluorine substitution on methyl amines,
J. Fluorine Chem., 1982, 19, 565. [all data]