Methane, dibromochloronitroso-
- Formula: CBr2ClNO
- Molecular weight: 237.278
- IUPAC Standard InChIKey: SBEWXCRGUOMHCR-UHFFFAOYSA-N
- CAS Registry Number: 73411-13-9
- Chemical structure:
View 3d structure (requires JavaScript / HTML 5) - Permanent link for this species. Use this link for bookmarking this species for future reference.

Gas phase ion energetics data

Data compiled by: Sharon G. Lias, Rhoda D. Levin, and Sherif A. Kafafi
Ionization energy determinations
IE (eV) | Method | Reference | Comment |
---|---|---|---|
10.02 ± 0.05 | PE | Ernsting, Pfab, et al., 1980 | Vertical value |

References

Ernsting, Pfab, et al., 1980
Ernsting, N.P.; Pfab, J.; Green, J.C.; Romelt, J.,
Photoelectron spectra of nitrosomethane, t-nitrosobutane and some perhalogenonitrosomethanes,
J. Chem. Soc. Faraday Trans. 2, 1980, 76, 844. [all data]