Chromium, pentacarbonyl[1-ethoxy-2,2-bis(trimethylsilyl)ethylidene]-
- Formula: C15H24CrO6Si2
- Molecular weight: 408.5146
- CAS Registry Number: 73382-48-6

Gas phase ion energetics data

Data compiled by: Sharon G. Lias, Rhoda D. Levin, and Sherif A. Kafafi
Ionization energy determinations
IE (eV) | Method | Reference | Comment |
---|---|---|---|
7.57 | PE | Lappert, McCabe, et al., 1980 | Vertical value |

References

Lappert, McCabe, et al., 1980
Lappert, M.F.; McCabe, R.W.; MacQuitty, J.J.; Pye, P.L.; Riley, P.I.,
Paramagnetic carbene-metal complexes. Part 1. Cationic chromium(I) complexes and the chemistry of their chromium(O) precursors and of related molybdenum(O) and tungsten(O) complexes, especially with bulky carbene ligands C(OR')R[R=CH(SiMe3)2 or CH2SiMe3],
J. Chem. Soc. Dalton Trans., 1980, 90. [all data]