XeClF
- Formula: ClFXe
- Molecular weight: 185.744
- CAS Registry Number: 73378-52-6

Vibrational and/or electronic energy levels

Data compiled by: Marilyn E. Jacox
State: X
Vib. sym. |
No. | Approximate type of mode |
cm-1 | Med. | Method | References | |
---|---|---|---|---|---|---|---|
Σ+ | 1 | Stretch | 316 | w m | Xe | IR | Howard and Andrews, 1974 |
1 | Stretch | 315.5 | Xe | Ra | Howard and Andrews, 1974 | ||
3 | Stretch | 481 | s | Xe | IR | Howard and Andrews, 1974 | |
3 | Stretch | 480 | Xe | Ra | Howard and Andrews, 1974 | ||
Additional references: Jacox, 1994, page 121

References

Howard and Andrews, 1974
Howard, W.F., Jr.; Andrews, L.,
Synthesis of noble-gas dihalides by laser photolysis of matrix-isolated halogens,
J. Am. Chem. Soc., 1974, 96, 26, 7864, https://doi.org/10.1021/ja00833a004
. [all data]
Jacox, 1994
Jacox, M.E.,
Vibrational and electronic energy levels of polyatomic transient molecules, American Chemical Society, Washington, DC, 1994, 464. [all data]