Melatonin
- Formula: C13H16N2O2
- Molecular weight: 232.2783
- IUPAC Standard InChIKey: DRLFMBDRBRZALE-UHFFFAOYSA-N
- CAS Registry Number: 73-31-4
- Chemical structure:
View 3d structure (requires JavaScript / HTML 5) - Other names: Acetamide, N-[2-(5-methoxy-1H-indol-3-yl)ethyl]-; Acetamide, N-[2-(5-methoxyindol-3-yl)ethyl]-; Melatonine; N-Acetyl-5-methoxytryptamine; 5-Methoxy-N-acetyltryptamine; N-[2-(5-Methoxy-1H-indol-3-yl)ethyl]acetamide; Circadin; NSC 113928; N-(2-(5-methoxyindol-3-yl)ethyl)acetamide

Gas phase ion energetics data

Data compiled by: Sharon G. Lias, John E. Bartmess, Joel F. Liebman, John L. Holmes, Rhoda D. Levin, and W. Gary Mallard
Ionization energy determinations
IE (eV) | Method | Reference | Comment |
---|---|---|---|
7.03 | PE | Cannington and Ham, 1983 | |
7.7 | PE | Cannington and Ham, 1983 | Vertical value |

Van Den Dool and Kratz RI, non-polar column, custom temperature program

Column type | Active phase | I | Reference | Comment |
---|---|---|---|---|
Capillary | VF-5MS | 2451.9 | Tret'yakov, 2008 | 30. m/0.25 mm/0.25 μm, He; Program: Multi-step temperature program; T(initial)=60C; T(final)=270C |

References

Cannington and Ham, 1983
Cannington, P.H.; Ham, N.S.,
He(I) and He(II) photoelectron spectra of glycine and related molecules,
J. Electron Spectrosc. Relat. Phenom., 1983, 32, 139. [all data]
Tret'yakov, 2008
Tret'yakov, K.V.,
Retention Data. NIST Mass Spectrometry Data Center., NIST Mass Spectrometry Data Center, 2008. [all data]