Adenine
- Formula: C5H5N5
- Molecular weight: 135.1267
- IUPAC Standard InChIKey: GFFGJBXGBJISGV-UHFFFAOYSA-N
- CAS Registry Number: 73-24-5
- Chemical structure:

Reaction thermochemistry data

Data compiled as indicated in comments:
B - John E. Bartmess
M - Michael M. Meot-Ner (Mautner) and Sharon G. Lias
RCD - Robert C. Dunbar
Individual Reactions
By formula: C5H4N5- + H+ = C5H5N5
Quantity | Value | Units | Method | Reference | Comment |
---|---|---|---|---|---|
ΔrH° | 1402. ± 9.2 | kJ/mol | G+TS | Sharma and Lee, 2002 | gas phase; Acidity at N-9(imidazole N); B |
Quantity | Value | Units | Method | Reference | Comment |
ΔrG° | 1372. ± 8.4 | kJ/mol | IMRB | Sharma and Lee, 2002 | gas phase; Acidity at N-9(imidazole N); B |
ΔrG° | 1441. ± 17. | kJ/mol | IMRB | Sharma and Lee, 2002 | gas phase; Less acidic N-10 site(aniline); B |
By formula: C5H6N5+ + C5H5N5 = (C5H6N5+ • C5H5N5)
Quantity | Value | Units | Method | Reference | Comment |
---|---|---|---|---|---|
ΔrH° | 127. | kJ/mol | PHPMS | Meot-Ner (Mautner), 1979 | gas phase; M |
Quantity | Value | Units | Method | Reference | Comment |
ΔrS° | 160. | J/mol*K | PHPMS | Meot-Ner (Mautner), 1979 | gas phase; M |
By formula: Na+ + C5H5N5 = (Na+ • C5H5N5)
Quantity | Value | Units | Method | Reference | Comment |
---|---|---|---|---|---|
ΔrH° | 140. ± 4.2 | kJ/mol | CIDT | Rodgers and Armentrout, 2000 | RCD |
ΔrH° | 172. | kJ/mol | CIDC | Cerda and Wesdemiotis, 1996 | RCD |
By formula: Ti+ + C5H5N5 = (Ti+ • C5H5N5)
Quantity | Value | Units | Method | Reference | Comment |
---|---|---|---|---|---|
ΔrH° | ≤339. ± 15. | kJ/mol | CIDT | Rodgers and Armentrout, 2002 | RCD |
By formula: V+ + C5H5N5 = (V+ • C5H5N5)
Quantity | Value | Units | Method | Reference | Comment |
---|---|---|---|---|---|
ΔrH° | ≤265. ± 10. | kJ/mol | CIDT | Rodgers and Armentrout, 2002 | RCD |
By formula: Zn+ + C5H5N5 = (Zn+ • C5H5N5)
Quantity | Value | Units | Method | Reference | Comment |
---|---|---|---|---|---|
ΔrH° | ≥238. ± 5.4 | kJ/mol | CIDT | Rodgers and Armentrout, 2002 | RCD |
By formula: Fe+ + C5H5N5 = (Fe+ • C5H5N5)
Quantity | Value | Units | Method | Reference | Comment |
---|---|---|---|---|---|
ΔrH° | 259. ± 8.8 | kJ/mol | CIDT | Rodgers and Armentrout, 2002 | RCD |
By formula: Cr+ + C5H5N5 = (Cr+ • C5H5N5)
Quantity | Value | Units | Method | Reference | Comment |
---|---|---|---|---|---|
ΔrH° | 231. ± 7.5 | kJ/mol | CIDT | Rodgers and Armentrout, 2002 | RCD |
By formula: Mn+ + C5H5N5 = (Mn+ • C5H5N5)
Quantity | Value | Units | Method | Reference | Comment |
---|---|---|---|---|---|
ΔrH° | 216. ± 7.5 | kJ/mol | CIDT | Rodgers and Armentrout, 2002 | RCD |
By formula: Ni+ + C5H5N5 = (Ni+ • C5H5N5)
Quantity | Value | Units | Method | Reference | Comment |
---|---|---|---|---|---|
ΔrH° | 297. ± 9.6 | kJ/mol | CIDT | Rodgers and Armentrout, 2002 | RCD |
By formula: Co+ + C5H5N5 = (Co+ • C5H5N5)
Quantity | Value | Units | Method | Reference | Comment |
---|---|---|---|---|---|
ΔrH° | 293. ± 10. | kJ/mol | CIDT | Rodgers and Armentrout, 2002 | RCD |
By formula: Cu+ + C5H5N5 = (Cu+ • C5H5N5)
Quantity | Value | Units | Method | Reference | Comment |
---|---|---|---|---|---|
ΔrH° | 294. ± 11. | kJ/mol | CIDT | Rodgers and Armentrout, 2002 | RCD |
By formula: K+ + C5H5N5 = (K+ • C5H5N5)
Quantity | Value | Units | Method | Reference | Comment |
---|---|---|---|---|---|
ΔrH° | 106. | kJ/mol | CIDC | Cerda and Wesdemiotis, 1996 | RCD |

Gas phase ion energetics data

Data evaluated as indicated in comments:
HL - Edward P. Hunter and Sharon G. Lias
Data compiled as indicated in comments:
B - John E. Bartmess
LLK - Sharon G. Lias, Rhoda D. Levin, and Sherif A. Kafafi
RDSH - Henry M. Rosenstock, Keith Draxl, Bruce W. Steiner, and John T. Herron
Quantity | Value | Units | Method | Reference | Comment |
---|---|---|---|---|---|
Proton affinity (review) | 942.8 | kJ/mol | N/A | Hunter and Lias, 1998 | HL |
Quantity | Value | Units | Method | Reference | Comment |
Gas basicity | 912.5 | kJ/mol | N/A | Hunter and Lias, 1998 | HL |
Electron affinity determinations
EA (eV) | Reference | Comment |
---|---|---|
0.0120 ± 0.0050 | Desfrancois, Abdoul-Carime, et al., 1996 | Aflatooni, Gallup, et al., 1998: vertical attachment EA = -0.54 eV; B |
Ionization energy determinations
IE (eV) | Method | Reference | Comment |
---|---|---|---|
8.3 ± 0.1 | EI | Verkin, Sukodub, et al., 1976 | LLK |
8.9 ± 0.1 | EI | Lifschitz, Bergmann, et al., 1967 | RDSH |
8.48 | PE | Lin, Yu, et al., 1980 | Vertical value; LLK |
8.48 | PE | Peng, Padva, et al., 1976 | Vertical value; LLK |
8.44 ± 0.03 | PE | Hush and Cheung, 1975 | Vertical value; LLK |
De-protonation reactions
By formula: C5H4N5- + H+ = C5H5N5
Quantity | Value | Units | Method | Reference | Comment |
---|---|---|---|---|---|
ΔrH° | 1402. ± 9.2 | kJ/mol | G+TS | Sharma and Lee, 2002 | gas phase; Acidity at N-9(imidazole N); B |
Quantity | Value | Units | Method | Reference | Comment |
ΔrG° | 1372. ± 8.4 | kJ/mol | IMRB | Sharma and Lee, 2002 | gas phase; Acidity at N-9(imidazole N); B |
ΔrG° | 1441. ± 17. | kJ/mol | IMRB | Sharma and Lee, 2002 | gas phase; Less acidic N-10 site(aniline); B |

Ion clustering data

Data compiled as indicated in comments:
M - Michael M. Meot-Ner (Mautner) and Sharon G. Lias
RCD - Robert C. Dunbar
Clustering reactions
By formula: C5H6N5+ + C5H5N5 = (C5H6N5+ • C5H5N5)
Quantity | Value | Units | Method | Reference | Comment |
---|---|---|---|---|---|
ΔrH° | 127. | kJ/mol | PHPMS | Meot-Ner (Mautner), 1979 | gas phase; M |
Quantity | Value | Units | Method | Reference | Comment |
ΔrS° | 160. | J/mol*K | PHPMS | Meot-Ner (Mautner), 1979 | gas phase; M |
By formula: Co+ + C5H5N5 = (Co+ • C5H5N5)
Quantity | Value | Units | Method | Reference | Comment |
---|---|---|---|---|---|
ΔrH° | 293. ± 10. | kJ/mol | CIDT | Rodgers and Armentrout, 2002 | RCD |
By formula: Cr+ + C5H5N5 = (Cr+ • C5H5N5)
Quantity | Value | Units | Method | Reference | Comment |
---|---|---|---|---|---|
ΔrH° | 231. ± 7.5 | kJ/mol | CIDT | Rodgers and Armentrout, 2002 | RCD |
By formula: Cu+ + C5H5N5 = (Cu+ • C5H5N5)
Quantity | Value | Units | Method | Reference | Comment |
---|---|---|---|---|---|
ΔrH° | 294. ± 11. | kJ/mol | CIDT | Rodgers and Armentrout, 2002 | RCD |
By formula: Fe+ + C5H5N5 = (Fe+ • C5H5N5)
Quantity | Value | Units | Method | Reference | Comment |
---|---|---|---|---|---|
ΔrH° | 259. ± 8.8 | kJ/mol | CIDT | Rodgers and Armentrout, 2002 | RCD |
By formula: K+ + C5H5N5 = (K+ • C5H5N5)
Quantity | Value | Units | Method | Reference | Comment |
---|---|---|---|---|---|
ΔrH° | 106. | kJ/mol | CIDC | Cerda and Wesdemiotis, 1996 | RCD |
By formula: Mn+ + C5H5N5 = (Mn+ • C5H5N5)
Quantity | Value | Units | Method | Reference | Comment |
---|---|---|---|---|---|
ΔrH° | 216. ± 7.5 | kJ/mol | CIDT | Rodgers and Armentrout, 2002 | RCD |
By formula: Na+ + C5H5N5 = (Na+ • C5H5N5)
Quantity | Value | Units | Method | Reference | Comment |
---|---|---|---|---|---|
ΔrH° | 140. ± 4.2 | kJ/mol | CIDT | Rodgers and Armentrout, 2000 | RCD |
ΔrH° | 172. | kJ/mol | CIDC | Cerda and Wesdemiotis, 1996 | RCD |
By formula: Ni+ + C5H5N5 = (Ni+ • C5H5N5)
Quantity | Value | Units | Method | Reference | Comment |
---|---|---|---|---|---|
ΔrH° | 297. ± 9.6 | kJ/mol | CIDT | Rodgers and Armentrout, 2002 | RCD |
By formula: Ti+ + C5H5N5 = (Ti+ • C5H5N5)
Quantity | Value | Units | Method | Reference | Comment |
---|---|---|---|---|---|
ΔrH° | ≤339. ± 15. | kJ/mol | CIDT | Rodgers and Armentrout, 2002 | RCD |
By formula: V+ + C5H5N5 = (V+ • C5H5N5)
Quantity | Value | Units | Method | Reference | Comment |
---|---|---|---|---|---|
ΔrH° | ≤265. ± 10. | kJ/mol | CIDT | Rodgers and Armentrout, 2002 | RCD |
By formula: Zn+ + C5H5N5 = (Zn+ • C5H5N5)
Quantity | Value | Units | Method | Reference | Comment |
---|---|---|---|---|---|
ΔrH° | ≥238. ± 5.4 | kJ/mol | CIDT | Rodgers and Armentrout, 2002 | RCD |

Condensed phase thermochemistry data

Data compiled as indicated in comments:
ALS - Hussein Y. Afeefy, Joel F. Liebman, and Stephen E. Stein
DH - Eugene S. Domalski and Elizabeth D. Hearing
Quantity | Value | Units | Method | Reference | Comment |
---|---|---|---|---|---|
ΔfH°solid | 96.9 ± 1.3 | kJ/mol | Ccr | Kirklin and Domalski, 1983 | ALS |
ΔfH°solid | 96.02 ± 0.92 | kJ/mol | Ccb | Stiehler and Huffman, 1935 | Reanalyzed by Cox and Pilcher, 1970, Original value = 91.04 kJ/mol; ALS |
Quantity | Value | Units | Method | Reference | Comment |
ΔcH°solid | -2779.0 ± 1.3 | kJ/mol | Ccr | Kirklin and Domalski, 1983 | ALS |
ΔcH°solid | -2778.1 ± 0.88 | kJ/mol | Ccb | Stiehler and Huffman, 1935 | Reanalyzed by Cox and Pilcher, 1970, Original value = -2777.1 ± 0.88 kJ/mol; ALS |
Quantity | Value | Units | Method | Reference | Comment |
S°solid,1 bar | 151.01 | J/mol*K | N/A | Stiehler and Huffman, 1935, 2 | Extrapolation below 90 K, 46.69 J/mol*K.; DH |
Constant pressure heat capacity of solid
Cp,solid (J/mol*K) | Temperature (K) | Reference | Comment |
---|---|---|---|
147.0 | 298. | Kilday, 1978 | DH |
143.13 | 298.1 | Stiehler and Huffman, 1935, 2 | T = 88 to 298 K. Value is unsmoothed experimental datum.; DH |

Phase change data

Data compiled as indicated in comments:
ALS - Hussein Y. Afeefy, Joel F. Liebman, and Stephen E. Stein
AC - William E. Acree, Jr., James S. Chickos
Quantity | Value | Units | Method | Reference | Comment |
---|---|---|---|---|---|
ΔsubH° | 110. | kJ/mol | V | Clark, Peschel, et al., 1965 | ALS |
Enthalpy of sublimation
ΔsubH (kJ/mol) | Temperature (K) | Method | Reference | Comment |
---|---|---|---|---|
109.2 | 460.5 | A | Stephenson and Malanowski, 1987 | Based on data from 448. to 473. K.; AC |
127.2 ± 1.9 | 403. to 439. | ME | Zielenkiewicz, Zielenkiewicz, et al., 1984 | AC |

Normal alkane RI, non-polar column, custom temperature program

Column type | Active phase | I | Reference | Comment |
---|---|---|---|---|
Capillary | DB-5 | 1836. | Pellicer, 2007 | 30. m/0.32 mm/0.25 μm, Helium; Program: not specified |

References

Sharma and Lee, 2002
Sharma, S.; Lee, J.K.,
Acidity of adenine and adenine derivatives and biological implications. A computational and experimental gas-phase study,
J. Org. Chem., 2002, 67, 24, 8360-8365, https://doi.org/10.1021/jo0204303
. [all data]
Meot-Ner (Mautner), 1979
Meot-Ner (Mautner), M.,
Ion Thermochemistry of Low Volatility Compounds in the Gas Phase. II. Intrinsic Basicities and Hydrogen Bonded Dimers of Nitrogen Heterocyclics and Nucleic Bases,
J. Am. Chem. Soc., 1979, 101, 9, 2396, https://doi.org/10.1021/ja00503a027
. [all data]
Rodgers and Armentrout, 2000
Rodgers, M.T.; Armentrout, P.B.,
Noncovalent Interactions of Nucleic Acid Bases (Uracil, Thymine, and Adenine) with Alkali Metal Ions. Threshold Collision-Induced Dissociation and Theoretical Studies,
J. Am. Chem. Soc., 2000, 121, 35, 8548, https://doi.org/10.1021/ja001638d
. [all data]
Cerda and Wesdemiotis, 1996
Cerda, B.A.; Wesdemiotis, C.,
PAs of Peptides,
J. Am. Chem. Soc., 1996, 118, 11884. [all data]
Rodgers and Armentrout, 2002
Rodgers, M.T.; Armentrout, P.B.,
Influence of d orbital occupation on the binding of metal ions to adenine,
J. Am. Chem. Soc., 2002, 124, 11, 2678, https://doi.org/10.1021/ja011278+
. [all data]
Hunter and Lias, 1998
Hunter, E.P.; Lias, S.G.,
Evaluated Gas Phase Basicities and Proton Affinities of Molecules: An Update,
J. Phys. Chem. Ref. Data, 1998, 27, 3, 413-656, https://doi.org/10.1063/1.556018
. [all data]
Desfrancois, Abdoul-Carime, et al., 1996
Desfrancois, C.; Abdoul-Carime, H.; Schermann, J.P.,
Electron Attachment to Isolated Nucleic Acid Bases,
J. Chem. Phys., 1996, 104, 19, 7792, https://doi.org/10.1063/1.471484
. [all data]
Aflatooni, Gallup, et al., 1998
Aflatooni, K.; Gallup, G.A.; Burrows, P.D.,
Electron Attachment Energies of the DNA Bases,
J. Phys. Chem., 1998, 102, 31, 6205, https://doi.org/10.1021/jp980865n
. [all data]
Verkin, Sukodub, et al., 1976
Verkin, B.I.; Sukodub, L.F.; Yanson, I.K.,
Ionization potentials of nitrogenous bases of of nucleic acids,
Dokl. Akad. Nauk SSSR, 1976, 228, 1452. [all data]
Lifschitz, Bergmann, et al., 1967
Lifschitz, C.; Bergmann, E.D.; Pullman, B.,
The ionization potentials of biological purines and pyrimidines,
Tetrahedron Lett., 1967, 4583. [all data]
Lin, Yu, et al., 1980
Lin, J.; Yu, C.; Peng, S.; Akiyama, I.; Li, K.; Lee, L.K.; LeBreton, P.R.,
Ultraviolet photoelectron studies of the ground-state electronic structure and gas-phase tautomerism of purine and adenine,
J. Am. Chem. Soc., 1980, 102, 4627. [all data]
Peng, Padva, et al., 1976
Peng, S.; Padva, A.; LeBreton, P.R.,
Ultraviolet photoelectron studies of biological purines: The valence electronic structure of adenine,
Proc. Nat. Acad. Sci. U.S.A., 1976, 73, 2966. [all data]
Hush and Cheung, 1975
Hush, N.S.; Cheung, A.S.,
Ionization potentials and donor properties of nucleic acid bases and related compounds,
Chem. Phys. Lett., 1975, 34, 11. [all data]