1,4-Ethanonaphthalene, 1,4-dihydro-
- Formula: C12H12
- Molecular weight: 156.2237
- IUPAC Standard InChIKey: XDZYFDZJEANUFX-UHFFFAOYSA-N
- CAS Registry Number: 7322-46-5
- Chemical structure:
View 3d structure (requires JavaScript / HTML 5) - Permanent link for this species. Use this link for bookmarking this species for future reference.

Phase change data

Data compiled by: Robert L. Brown and Stephen E. Stein
Reduced pressure boiling point
Tboil (K) | Pressure (bar) | Reference |
---|---|---|
352. to 353. | 0.001 | Buckingham and Donaghy, 1982 |

Gas phase ion energetics data

Data compiled as indicated in comments:
LBLHLM - Sharon G. Lias, John E. Bartmess, Joel F. Liebman, John L. Holmes, Rhoda D. Levin, and W. Gary Mallard
Ionization energy determinations
IE (eV) | Method | Reference | Comment |
---|---|---|---|
8.2 | PE | Haselbach, Neuhaus, et al., 1982 | LBLHLM |
8.54 | PE | Haselbach, Neuhaus, et al., 1982 | Vertical value; LBLHLM |

References

Buckingham and Donaghy, 1982
Buckingham, J.; Donaghy, S.M.,
Dictionary of Organic Compounds: Fifth Edition, Chapman and Hall, New York, 1982, 1. [all data]
Haselbach, Neuhaus, et al., 1982
Haselbach, E.; Neuhaus, L.; Johnson, R.P.; Houk, K.N.; Paddon-Row, M.N.,
.PI.-Orbital interactions in mobius-type molecules as studied by photoelectron spectroscopy,
Helv. Chim. Acta, 1982, 65, 1743. [all data]