Phosmet
- Formula: C11H12NO3PS
- Molecular weight: 269.257
- IUPAC Standard InChIKey: LMNZTLDVJIUSHT-UHFFFAOYSA-N
- CAS Registry Number: 732-11-6
- Chemical structure:
View 3d structure (requires JavaScript / HTML 5) - Other names: Imidan; Fosmet; Phosphorodithioic acid, S-[(1,3-dihydro-1,3-dioxo-2H-isoindol-2-yl)methyl] O,O-dimethyl ester; Phosphorodithioic acid, O,O-dimethyl ester, S-ester with N-(mercaptomethyl)phthalimide; Decemthion; Decemthion P-6; Ftalophos; N-(Mercaptomethyl)phthalimide S-(O,O-dimethyl) phosphorodithioate; O,O-Dimethyl S-(phthalimidomethyl)dithiophosphate; O,O-Dimethyl S-(phthalimidomethyl)phosphorodithioate; O,O-Dimethyl S-(N-phthalimidomethyl)dithiophosphate; Phthalophos; Prolate; PMP; PMP (Pesticide); R 1504; Safidon; Smidan; Stauffer R 1504; Appa; (O,O-Dimethyl-phthalimidiomethyl-dithiophosphate); ENT 25,705; Kemolate; Percolate; Phosphorodithioic acid, S-((1,3-dihydro-1,3-dioxo-isoindol-2-yl)methyl) O,O-dimethyl ester; Phthalimide, N-(mercaptomethyl)-, S-ester with O,O-dimethyl phosphorodithioate; Phthalimido O,O-dimethyl phosphorodithioate; Phthalimidomethyl O,O-dimethyl phosphorodithioate; Imidathion; Simidan

Phase change data

Data compiled as indicated in comments:
TRC - Thermodynamics Research Center, NIST Boulder Laboratories, Chris Muzny director
AC - William E. Acree, Jr., James S. Chickos
Quantity | Value | Units | Method | Reference | Comment |
---|---|---|---|---|---|
Tfus | 344.00 | K | N/A | Donnelly, Drewes, et al., 1990 | Uncertainty assigned by TRC = 0.2 K; TRC |
Tfus | 345.2 | K | N/A | Plato and Glasgow, 1969 | Uncertainty assigned by TRC = 0.1 K; TRC |
Enthalpy of fusion
ΔfusH (kJ/mol) | Temperature (K) | Method | Reference | Comment |
---|---|---|---|---|
26.96 | 343.2 | DSC | Donnelly, Drewes, et al., 1990, 2 | AC |

References

Donnelly, Drewes, et al., 1990
Donnelly, J.R.; Drewes, L.A.; Johnson, R.L.; Munslow, W.D.; Knapp, K.K.; Sovocool, G.W.,
Purity and heat of fusion data for environmental standards as determined by differential scanning calorimetry,
Thermochim. Acta, 1990, 167, 2, 155, https://doi.org/10.1016/0040-6031(90)80476-F
. [all data]
Plato and Glasgow, 1969
Plato, C.; Glasgow, A.R., Jr.,
Differential scanning calorimetry as a general method for determining the purity and heat of fusion of high-purity organic chemicals. Application to 95 compounds,
Anal. Chem., 1969, 41, 2, 330, https://doi.org/10.1021/ac60271a041
. [all data]
Donnelly, Drewes, et al., 1990, 2
Donnelly, J.R.; Drewes, L.A.; Johnson, R.L.; Munslow, W.D.; Knapp, K.K.; Sovocool, G.W.,
Purity and heat of fusion data for environmental standards as determined by differential scanning calorimetry,
Thermochimica Acta, 1990, 167, 2, 155-187, https://doi.org/10.1016/0040-6031(90)80476-F
. [all data]