Boronic acid, methyl-, dimethyl ester
- Formula: C3H9BO2
- Molecular weight: 87.913
- IUPAC Standard InChIKey: BINBUVDYVMWEGQ-UHFFFAOYSA-N
- CAS Registry Number: 7318-81-2
- Chemical structure:
View 3d structure (requires JavaScript / HTML 5) - Permanent link for this species. Use this link for bookmarking this species for future reference.

Gas phase ion energetics data

Data compiled by: Sharon G. Lias, Rhoda D. Levin, and Sherif A. Kafafi
Ionization energy determinations
IE (eV) | Method | Reference | Comment |
---|---|---|---|
10.40 | PE | Kroner, Nolle, et al., 1973 | Vertical value |

References

Kroner, Nolle, et al., 1973
Kroner, J.; Nolle, D.; Noth, H.,
Photoelektronenspektroskopische untersuchungen an bor-verbindungen, I Orbitalreihenfolgen und ladungsdichten in methylthiound methoxyborane,
Z. Naturforsch. B:, 1973, 28, 416. [all data]