Methyldichloroborane
- Formula: CH3BCl2
- Molecular weight: 96.752
- IUPAC Standard InChIKey: WRWXDQSBUPVVPD-UHFFFAOYSA-N
- CAS Registry Number: 7318-78-7
- Chemical structure:
View 3d structure (requires JavaScript / HTML 5) - Permanent link for this species. Use this link for bookmarking this species for future reference.

Gas phase ion energetics data

Data compiled as indicated in comments:
LLK - Sharon G. Lias, Rhoda D. Levin, and Sherif A. Kafafi
Ionization energy determinations
IE (eV) | Method | Reference | Comment |
---|---|---|---|
11.51 | PE | Berger, Kroner, et al., 1976 | LLK |

References

Berger, Kroner, et al., 1976
Berger, H.-O.; Kroner, J.; Noth, H.,
Die borhalogen-bindung in Methylhalogenboranen: Photoelektronenspektren und ab initio-Rechnungen,
Chem. Ber., 1976, 109, 2266. [all data]