1-Methyl-1-phenylcyclobutane
- Formula: C11H14
- Molecular weight: 146.2289
- IUPAC Standard InChIKey: GRDSPXXZEBFXHZ-UHFFFAOYSA-N
- CAS Registry Number: 7306-05-0
- Chemical structure:
View 3d structure (requires JavaScript / HTML 5) - Other names: Benzene, (1-methylcyclobutyl)-

Phase change data

Data compiled by: Thermodynamics Research Center, NIST Boulder Laboratories, Chris Muzny director
Quantity | Value | Units | Method | Reference | Comment |
---|---|---|---|---|---|
Tboil | 481.8 | K | N/A | Ipatieff and Pines, 1939 | Uncertainty assigned by TRC = 0.5 K |

Gas phase ion energetics data

Data compiled by: Sharon G. Lias, Rhoda D. Levin, and Sherif A. Kafafi
Ionization energy determinations
IE (eV) | Method | Reference |
---|---|---|
8.1 | EI | Mikaya, Zaikin, et al., 1979 |
Appearance energy determinations
Ion | AE (eV) | Other Products | Method | Reference | Comment |
---|---|---|---|---|---|
C9H10+ | 9.5 | C2H4 | EI | Mikaya, Zaikin, et al., 1979 |

References

Ipatieff and Pines, 1939
Ipatieff, V.N.; Pines, H.,
Reaction of Benzene with Methylcyclobutene and Methylenecyclobutane in the Presence of Sulfuric Acid,
J. Am. Chem. Soc., 1939, 61, 3374-6. [all data]
Mikaya, Zaikin, et al., 1979
Mikaya, A.I.; Zaikin, V.G.; Finkel'stein, E.S.; Vdovin, V.M.,
Mass-spectrometric investigation of aromatic derivatives of cycloalkanes and cycloalkanols,
Izv. Akad. Nauk SSSR, Ser. Khim., 1979, 10, 2221. [all data]