(Dispiro[tetracyclo[3.2.0.0<sup>2,7</sup>.0<sup>4,6</sup>]heptane-3,1'-cyclopropane-2',3''-tetracyclo[3.2.0.0<sup>2,7</sup>.0<sup>4,6</sup>]heptane)
- Formula: C15H14
- Molecular weight: 194.2717
- IUPAC Standard InChIKey: QGGHADUOSDKJIR-UHFFFAOYSA-N
- CAS Registry Number: 73050-58-5
- Chemical structure:
View 3d structure (requires JavaScript / HTML 5) - Other names: (Dispiro[tetracyclo[3.2.0.02,7.04,6]heptane-3,1'-cyclopropane-2',3''-tetracyclo[3.2.0.02,7.04,6]heptane)

Gas phase ion energetics data

Data compiled as indicated in comments:
LLK - Sharon G. Lias, Rhoda D. Levin, and Sherif A. Kafafi
Ionization energy determinations
IE (eV) | Method | Reference | Comment |
---|---|---|---|
7.6 | PE | Kovac, Heilbronner, et al., 1979 | LLK |
Appearance energy determinations
Ion | AE (eV) | Other Products | Method | Reference | Comment |
---|---|---|---|---|---|
C15H14+ | 8.4 | ? | PE | Kovac, Heilbronner, et al., 1979 | Vertical value; LLK |

References

Kovac, Heilbronner, et al., 1979
Kovac, B.; Heilbronner, E.; Prinzbach, H.; Weidmann, K.,
288. The photoelectron spectra of D2d and C2v hydrocarbons containing two norbornadiene or quadricylane groups,
Helv. Chim. Acta, 1979, 62, 2841. [all data]