2-Pyridinethiol
- Formula: C5H5NS
- Molecular weight: 111.165
- IUPAC Standard InChIKey: WHMDPDGBKYUEMW-UHFFFAOYSA-N
- CAS Registry Number: 73018-10-7
- Chemical structure:
View 3d structure (requires JavaScript / HTML 5) - Species with the same structure:

Gas phase ion energetics data

Data compiled as indicated in comments:
LLK - Sharon G. Lias, Rhoda D. Levin, and Sherif A. Kafafi
Ionization energy determinations
IE (eV) | Method | Reference | Comment |
---|---|---|---|
8.68 | PE | Dreier, Becher, et al., 1981 | Vertical value; LLK |
8.79 ± 0.03 | PE | Cook, El-Abbady, et al., 1977 | Vertical value; LLK |

References

Dreier, Becher, et al., 1981
Dreier, C.; Becher, J.; Frandsen, E.G.; Henriksen, L.,
Pyridinethiones - V. Spectroscopic investigation and electronic structure of 3-formyl-2(1H)-pyridones,-thiones and -selones,
Tetrahedron, 1981, 37, 2663. [all data]
Cook, El-Abbady, et al., 1977
Cook, M.J.; El-Abbady, S.; Katritzky, A.R.; Guimon, C.; Pfister-Guillouzo, G.,
Photoelectron spectra of hydroxy- and mercapto-pyridines and models of fixed structure,
J. Chem. Soc. Perkin Trans. 2, 1977, 1652. [all data]