2-Pentyn-4-one
- Formula: C5H6O
- Molecular weight: 82.1005
- IUPAC Standard InChIKey: DZOOXMGZVWHNAS-UHFFFAOYSA-N
- CAS Registry Number: 7299-55-0
- Chemical structure:
View 3d structure (requires JavaScript / HTML 5) - Other names: 3-Pentyn-2-one; Pent-3-yn-2-one; 3-Pentyne-2-one

Gas phase ion energetics data

Data compiled by: Sharon G. Lias, Rhoda D. Levin, and Sherif A. Kafafi
Ionization energy determinations
IE (eV) | Method | Reference | Comment |
---|---|---|---|
9.76 | PE | Carlier and Mouvier, 1979 | Vertical value |

References

Carlier and Mouvier, 1979
Carlier, P.; Mouvier, G.,
Etude par spectrometrie de photoelectrons de la structure electronique des ynals et des ynones conjugues,
J. Electron Spectrosc. Relat. Phenom., 1979, 17, 169. [all data]