vinylsilane
- Formula: C2H6Si
- Molecular weight: 58.1545
- IUPAC Standard InChIKey: UKRDPEFKFJNXQM-UHFFFAOYSA-N
- CAS Registry Number: 7291-09-0
- Chemical structure:
View 3d structure (requires JavaScript / HTML 5) - Other names: Silane, ethenyl-

Gas phase ion energetics data

Data compiled as indicated in comments:
LLK - Sharon G. Lias, Rhoda D. Levin, and Sherif A. Kafafi
Ionization energy determinations
IE (eV) | Method | Reference | Comment |
---|---|---|---|
10.4 | PE | Weidner and Schweig, 1972 | Vertical value; LLK |
10.37 | PE | Mollere, Bock, et al., 1972 | Vertical value; LLK |

References

Weidner and Schweig, 1972
Weidner, U.; Schweig, A.,
Theory and application of photoelectron spectroscopy. V. The nature of bonding in vinyl- and allylsilanes: the effects of σ-π (hyperconjugation) pπ-dπ conjugation in these compounds,
J. Organomet. Chem., 1972, 39, 261. [all data]
Mollere, Bock, et al., 1972
Mollere, P.; Bock, H.; Becker, G.; Fritz, G.,
Photoelectron spectra and molecular properties. XV. The effects of α- and β-silyl substituents on π-systems,
J. Organomet. Chem., 1972, 46, 89. [all data]