1,3-Diphenoxypropane
- Formula: C15H16O2
- Molecular weight: 228.2863
- IUPAC Standard InChIKey: HZIVULLSUOJNPX-UHFFFAOYSA-N
- CAS Registry Number: 726-44-3
- Chemical structure:

Phase change data

Data compiled by: Robert L. Brown and Stephen E. Stein
Quantity | Value | Units | Method | Reference | Comment |
---|---|---|---|---|---|
Tboil | 612.2 | K | N/A | Weast and Grasselli, 1989 |

Gas phase ion energetics data

Data compiled by: Sharon G. Lias, Rhoda D. Levin, and Sherif A. Kafafi
Ionization energy determinations
IE (eV) | Method | Reference |
---|---|---|
8.46 ± 0.05 | EI | Schwarz, Petersen, et al., 1977 |

References

Weast and Grasselli, 1989
CRC Handbook of Data on Organic Compounds, 2nd Editon, Weast,R.C and Grasselli, J.G., ed(s)., CRC Press, Inc., Boca Raton, FL, 1989, 1. [all data]
Schwarz, Petersen, et al., 1977
Schwarz, H.; Petersen, R.D.; Van De Sande, C.C.,
Entropische und energetische Effekte bei der Bildung cyclischer Oxonium-, Sulfonium- und Bromonium-Ionen aus ωsubstituierten Phenoxyalkanen,
Org. Mass Spectrom., 1977, 12, 391. [all data]