Benzenamine, 4-[(4-nitrophenyl)methyl]-
- Formula: C13H12N2O2
- Molecular weight: 228.2466
- IUPAC Standard InChIKey: XTAVQWSBKJAURD-UHFFFAOYSA-N
- CAS Registry Number: 726-17-0
- Chemical structure:
View 3d structure (requires JavaScript / HTML 5) - Permanent link for this species. Use this link for bookmarking this species for future reference.

Gas phase ion energetics data

Data compiled by: Sharon G. Lias, Rhoda D. Levin, and Sherif A. Kafafi
Ionization energy determinations
IE (eV) | Method | Reference |
---|---|---|
7.87 ± 0.05 | EI | Pignataro, Mancini, et al., 1972 |
Appearance energy determinations
Ion | AE (eV) | Other Products | Method | Reference | Comment |
---|---|---|---|---|---|
C7H8N+ | 11.6 ± 0.2 | ? | EI | Innorta, Torroni, et al., 1973 |

References

Pignataro, Mancini, et al., 1972
Pignataro, S.; Mancini, V.; Innorta, G.; Distefano, G.,
Ionization energies and ring orbital interaction in diarylmethanes and diaryleth,
Z. Naturforsch., 1972, 27, 534. [all data]
Innorta, Torroni, et al., 1973
Innorta, G.; Torroni, S.; Pignataro, S.; Mancini, V.,
The activation energy as guiding factor in the fragmentation of substituted diphenylmethanes,
Org. Mass Spectrom., 1973, 7, 1399. [all data]