Bicyclo[4.2.1]nonane,2,5-bis(methylene)-
- Formula: C11H16
- Molecular weight: 148.2447
- IUPAC Standard InChIKey: FELIDMKPXYLJRQ-UHFFFAOYSA-N
- CAS Registry Number: 72569-86-9
- Chemical structure:
View 3d structure (requires JavaScript / HTML 5) - Permanent link for this species. Use this link for bookmarking this species for future reference.

Gas phase ion energetics data

Data compiled by: Sharon G. Lias, Rhoda D. Levin, and Sherif A. Kafafi
Ionization energy determinations
IE (eV) | Method | Reference | Comment |
---|---|---|---|
8.90 | PE | Martin, Heller, et al., 1980 | Vertical value |

References

Martin, Heller, et al., 1980
Martin, H.-D.; Heller, C.; Mayer, B.; Beckhaus, H.-D.,
Synthese bicyclischer, nicht-konjugierter Polyene. Stereochemie und transanulare Wechselwirkungen,
Chem. Ber., 1980, 113, 2589. [all data]