Bicyclo[4.2.1]non-7-ene,2,5-bis(methylene)-
- Formula: C11H14
- Molecular weight: 146.2289
- IUPAC Standard InChIKey: DMAXQZNAFWATIU-UHFFFAOYSA-N
- CAS Registry Number: 72569-85-8
- Chemical structure:
View 3d structure (requires JavaScript / HTML 5) - Permanent link for this species. Use this link for bookmarking this species for future reference.

Gas phase ion energetics data

Data compiled by: Sharon G. Lias, Rhoda D. Levin, and Sherif A. Kafafi
Appearance energy determinations
Ion | AE (eV) | Other Products | Method | Reference | Comment |
---|---|---|---|---|---|
C11H14+ | 8.90 | ? | PE | Martin and Heller, 1979 | Vertical value |

References

Martin and Heller, 1979
Martin, H.-D.; Heller, C.,
Synthese homokonjugierter Polyene: 2,4-Dimethylenbicyclo[3.2.0]oct-6-en und 2,5-Dimethylenbicyclo[4.2.0]non-7-en,
Monatsh. Chem., 1979, 110, 1271. [all data]