Bicyclo[3.2.1.]oct-6-ene,2,4-bis(methylene)-
- Formula: C10H12
- Molecular weight: 132.2023
- IUPAC Standard InChIKey: VCWNQCKVRJKXPY-UHFFFAOYSA-N
- CAS Registry Number: 72569-84-7
- Chemical structure:
View 3d structure (requires JavaScript / HTML 5) - Permanent link for this species. Use this link for bookmarking this species for future reference.

Gas phase ion energetics data

Data compiled as indicated in comments:
LLK - Sharon G. Lias, Rhoda D. Levin, and Sherif A. Kafafi
Ionization energy determinations
IE (eV) | Method | Reference | Comment |
---|---|---|---|
~9.0 | PE | Martin, Heller, et al., 1980 | Vertical value; LLK |
Appearance energy determinations
Ion | AE (eV) | Other Products | Method | Reference | Comment |
---|---|---|---|---|---|
C10H12+ | 8.98 | ? | PE | Martin and Heller, 1979 | Vertical value; LLK |

References

Martin, Heller, et al., 1980
Martin, H.-D.; Heller, C.; Mayer, B.; Beckhaus, H.-D.,
Synthese bicyclischer, nicht-konjugierter Polyene. Stereochemie und transanulare Wechselwirkungen,
Chem. Ber., 1980, 113, 2589. [all data]
Martin and Heller, 1979
Martin, H.-D.; Heller, C.,
Synthese homokonjugierter Polyene: 2,4-Dimethylenbicyclo[3.2.0]oct-6-en und 2,5-Dimethylenbicyclo[4.2.0]non-7-en,
Monatsh. Chem., 1979, 110, 1271. [all data]