3-Phenyleicosane
- Formula: C26H46
- Molecular weight: 358.6434
- IUPAC Standard InChIKey: KPJGRQMPFRXLSD-UHFFFAOYSA-N
- CAS Registry Number: 72557-70-1
- Chemical structure:
View 3d structure (requires JavaScript / HTML 5) - Species with the same structure:

Gas phase ion energetics data

Data compiled as indicated in comments:
RDSH - Henry M. Rosenstock, Keith Draxl, Bruce W. Steiner, and John T. Herron
Ionization energy determinations
IE (eV) | Method | Reference | Comment |
---|---|---|---|
9.0 ± 0.1 | EI | King, 1965 | RDSH |
Appearance energy determinations
Ion | AE (eV) | Other Products | Method | Reference | Comment |
---|---|---|---|---|---|
C8H9+ | 11.3 ± 0.1 | ? | EI | King, 1965 | RDSH |
C9H11+ | 10.7 ± 0.1 | ? | EI | King, 1965 | RDSH |
C24H41+ | 9.7 ± 0.1 | ? | EI | King, 1965 | RDSH |

References

King, 1965
King, A.B.,
Mass-spectral fragmentation of phenyl-n-alkanes,
J. Chem. Phys., 1965, 42, 3526. [all data]