1,3,4-Oxadiazole, 2,5-diphenyl-
- Formula: C14H10N2O
- Molecular weight: 222.2420
- IUPAC Standard InChIKey: DCJKUXYSYJBBRD-UHFFFAOYSA-N
- CAS Registry Number: 725-12-2
- Chemical structure:
View 3d structure (requires JavaScript / HTML 5) - Other names: 2,5-Diphenyloxadiazole; 2,5-Diphenyl-1,3,4-oxadiazole; PPD; PPD (Scintillator)

Condensed phase thermochemistry data

Data compiled by: Hussein Y. Afeefy, Joel F. Liebman, and Stephen E. Stein
Quantity | Value | Units | Method | Reference | Comment |
---|---|---|---|---|---|
ΔfH°solid | 75.7 | kJ/mol | Ccb | Karyakin, Mochalov, et al., 1975 | |
Quantity | Value | Units | Method | Reference | Comment |
ΔcH°solid | -7014. ± 4. | kJ/mol | Ccb | Karyakin, Mochalov, et al., 1975 | |
ΔcH°solid | -7103.6 ± 8.4 | kJ/mol | Ccb | Milone and Allavena, 1931 | Reanalyzed by Cox and Pilcher, 1970, Original value = -7104. kJ/mol |

Phase change data

Data compiled by: Robert L. Brown and Stephen E. Stein
Reduced pressure boiling point
Tboil (K) | Pressure (bar) | Reference |
---|---|---|
504.2 | 0.017 | Aldrich Chemical Company Inc., 1990 |

Gas phase ion energetics data

Data compiled by: Henry M. Rosenstock, Keith Draxl, Bruce W. Steiner, and John T. Herron
Ionization energy determinations
IE (eV) | Method | Reference |
---|---|---|
8.9 ± 0.3 | EI | Cotter, 1964 |
Appearance energy determinations
Ion | AE (eV) | Other Products | Method | Reference | Comment |
---|---|---|---|---|---|
C7H5O+ | 12.1 ± 0.2 | ? | EI | Cotter, 1964 |

References

Karyakin, Mochalov, et al., 1975
Karyakin, N.V.; Mochalov, A.N.; Rabinovich, I.B.; Kamelova, G.P.; Berestneva, G.L.; Astaf'ev, S.A.; Korshak, V.V.,
Thermodynamics of synthesis of poly-(p,p'-diphenyl-enexido) -1,3,4-oxadiazole by intramolecular cyclodehydration of poly-(p,p'-diphenyleneoxido)-hydrazide,
Polym. Sci. USSR, 1975, 17, 2174-2181. [all data]
Milone and Allavena, 1931
Milone, M.; Allavena, S.,
Sul calore di combustione di alcuni composti eterociclici,
Gazz. Chim. Ital., 1931, 61, 75-90. [all data]
Cox and Pilcher, 1970
Cox, J.D.; Pilcher, G.,
Thermochemistry of Organic and Organometallic Compounds, Academic Press, New York, 1970, 1-636. [all data]
Aldrich Chemical Company Inc., 1990
Aldrich Chemical Company Inc.,
Catalog Handbook of Fine Chemicals, Aldrich Chemical Company, Inc., Milwaukee WI, 1990, 1. [all data]
Cotter, 1964
Cotter, J.L.,
Electron-impact fragmentation patterns of 3,5-diphenyl-1,2,4-oxadiazole and 2,5-diphenyl-1,3,4-oxadiazole,
J. Chem. Soc., 1964, 5491. [all data]