Methane, fluorotrichloro- anion
- Formula: CCl3F-
- Molecular weight: 137.369
- IUPAC Standard InChIKey: HSIOQZZCQMERED-UHFFFAOYSA-N
- CAS Registry Number: 72346-72-6
- Chemical structure:
View 3d structure (requires JavaScript / HTML 5) - Permanent link for this species. Use this link for bookmarking this species for future reference.

Gas phase thermochemistry data

Data compiled by: John E. Bartmess
Quantity | Value | Units | Method | Reference | Comment |
---|---|---|---|---|---|
ΔfH°gas | -395. ± 30. | kJ/mol | R-EA | Dispert and Lacmann, 1978 |

Vibrational and/or electronic energy levels

Data compiled by: Marilyn E. Jacox
State: X
Vib. sym. |
No. | Approximate type of mode |
cm-1 | Med. | Method | References | |
---|---|---|---|---|---|---|---|
CF stretch | 1056 | m s | Ar | IR | Prochaska and Andrews, 1978 | ||
CCl stretch | 776 | m | Ar | IR | Prochaska and Andrews, 1978 | ||
486 | s | Ar | IR | Prochaska and Andrews, 1978 | |||
440 | m s | Ar | IR | Prochaska and Andrews, 1978 | |||
Additional references: Jacox, 1994, page 303

References

Dispert and Lacmann, 1978
Dispert, H.; Lacmann, K.,
Negative ion formation in collisions between potassium and fluoro- and chloromethanes: Electron affinities and bond dissociation energies,
Int. J. Mass Spectrom. Ion Phys., 1978, 28, 49. [all data]
Prochaska and Andrews, 1978
Prochaska, F.T.; Andrews, L.,
Matrix radiolysis and photoionization of CFCl3. Infrared spectra of CFCl+2 and the parent cation,
J. Chem. Phys., 1978, 68, 12, 5568, https://doi.org/10.1063/1.435686
. [all data]
Jacox, 1994
Jacox, M.E.,
Vibrational and electronic energy levels of polyatomic transient molecules, American Chemical Society, Washington, DC, 1994, 464. [all data]