2-Propyn-1-amine, N,N-dimethyl-
- Formula: C5H9N
- Molecular weight: 83.1317
- IUPAC Standard InChIKey: ILBIXZPOMJFOJP-UHFFFAOYSA-N
- CAS Registry Number: 7223-38-3
- Chemical structure:
View 3d structure (requires JavaScript / HTML 5) - Other names: N,N-Dimethyl-2-propyn-1-amine; (CH3)2NCH2C≡CH; 1-Dimethylamino-2-propyne; 3-Dimethylamino-1-propyne; N,N-dimethyl propargylamine; N-(2-Propynyl)-N,N-dimethylamine; Dimethyl propargylamine; dimethyl(prop-2-ynyl)amine

Condensed phase thermochemistry data

Data compiled by: Hussein Y. Afeefy, Joel F. Liebman, and Stephen E. Stein
Quantity | Value | Units | Method | Reference | Comment |
---|---|---|---|---|---|
ΔfH°liquid | 197.6 ± 1.7 | kJ/mol | Ccb | Shirokikh, Bystrov, et al., 1966 | Reanalyzed by Cox and Pilcher, 1970, Original value = 197. ± 2. kJ/mol |
Quantity | Value | Units | Method | Reference | Comment |
ΔcH°liquid | -3451.4 ± 1.7 | kJ/mol | Ccb | Shirokikh, Bystrov, et al., 1966 | Reanalyzed by Cox and Pilcher, 1970, Original value = -3452. ± 2. kJ/mol |

Phase change data

Data compiled by: Robert L. Brown and Stephen E. Stein
Quantity | Value | Units | Method | Reference | Comment |
---|---|---|---|---|---|
Tboil | 353. to 354. | K | N/A | Farchan Laboratories, 1990 | |
Tboil | 354.2 | K | N/A | Weast and Grasselli, 1989 | |
Tboil | 355. | K | N/A | Buckingham and Donaghy, 1982 |

Gas phase ion energetics data

Data evaluated as indicated in comments:
HL - Edward P. Hunter and Sharon G. Lias
Data compiled as indicated in comments:
LLK - Sharon G. Lias, Rhoda D. Levin, and Sherif A. Kafafi
Quantity | Value | Units | Method | Reference | Comment |
---|---|---|---|---|---|
Proton affinity (review) | 940.3 | kJ/mol | N/A | Hunter and Lias, 1998 | HL |
Quantity | Value | Units | Method | Reference | Comment |
Gas basicity | 909.5 | kJ/mol | N/A | Hunter and Lias, 1998 | HL |
Ionization energy determinations
IE (eV) | Method | Reference | Comment |
---|---|---|---|
8.29 ± 0.03 | PI | Loguinov, Takhistov, et al., 1981 | LLK |
8.17 | PI | Akopyan, Vilesov, et al., 1975 | LLK |
8.22 ± 0.05 | PE | Akopyan and Loginov, 1974 | LLK |
Appearance energy determinations
Ion | AE (eV) | Other Products | Method | Reference | Comment |
---|---|---|---|---|---|
C3H6+ | 9.39 | C2H3N | PI | Akopyan, Vilesov, et al., 1975 | LLK |
C3H8N+ | 9.49 ± 0.05 | C2H | PI | Loguinov, Takhistov, et al., 1981 | LLK |
C5H8N+ | 9.29 | H | PI | Akopyan, Vilesov, et al., 1975 | LLK |

Normal alkane RI, non-polar column, temperature ramp

Column type | Active phase | I | Reference | Comment |
---|---|---|---|---|
Capillary | OV-101 | 637. | Zenkevich, 2005 | 25. m/0.20 mm/0.10 μm, N2/He, 6. K/min; Tstart: 50. C; Tend: 250. C |

References

Shirokikh, Bystrov, et al., 1966
Shirokikh, P.K.; Bystrov, V.M.; Ponomarev, V.V.; Solntsev, V.A.,
Heats of combustion and enthalpies of formation of certain acetylenic amines,
Russ. J. Phys. Chem. (Engl. Transl.), 1966, 40, 894-895. [all data]
Cox and Pilcher, 1970
Cox, J.D.; Pilcher, G.,
Thermochemistry of Organic and Organometallic Compounds, Academic Press, New York, 1970, 1-636. [all data]
Farchan Laboratories, 1990
Farchan Laboratories,
Research Chemicals Catalog, Farchan Laboratories, Gainesville, FL, 1990, 91. [all data]
Weast and Grasselli, 1989
CRC Handbook of Data on Organic Compounds, 2nd Editon, Weast,R.C and Grasselli, J.G., ed(s)., CRC Press, Inc., Boca Raton, FL, 1989, 1. [all data]
Buckingham and Donaghy, 1982
Buckingham, J.; Donaghy, S.M.,
Dictionary of Organic Compounds: Fifth Edition, Chapman and Hall, New York, 1982, 1. [all data]
Hunter and Lias, 1998
Hunter, E.P.; Lias, S.G.,
Evaluated Gas Phase Basicities and Proton Affinities of Molecules: An Update,
J. Phys. Chem. Ref. Data, 1998, 27, 3, 413-656, https://doi.org/10.1063/1.556018
. [all data]
Loguinov, Takhistov, et al., 1981
Loguinov, Y.; Takhistov, V.V.; Vatlina, L.P.,
Photoionization studies of substituted trimethylamines,
Org. Mass Spectrom., 1981, 16, 239. [all data]
Akopyan, Vilesov, et al., 1975
Akopyan, M.E.; Vilesov, F.I.; Loginov, Y.V.,
Photoionization of amines and the monomolecular decomposition of excited molecular ions,
Khim. Vys. Energ., 1975, 9, 327. [all data]
Akopyan and Loginov, 1974
Akopyan, M.E.; Loginov, Yu.V.,
Photoelectron spectra of trimethylamine derivatives,
Opt. Spectrosc., 1974, 37, 250, In original 442. [all data]
Zenkevich, 2005
Zenkevich, I.G.,
Experimentally measured retention indices., 2005. [all data]