4-tert-Butyl-1(1-thioxo-2,2-dimethyl-propyl)-benzene

Gas phase ion energetics data

Data compiled by: Sharon G. Lias and Joel F. Liebman

Ionization energy determinations

IE (eV) Method Reference
7.85PITakhistov, Misharev, et al., 1995
8.96PITakhistov, Misharev, et al., 1995

Appearance energy determinations

Ion AE (eV) Other Products MethodReferenceComment
C10H11OS+9.59CH3PITakhistov, Misharev, et al., 1995
C11H13O+[(CH3)3CC6H4CO+]9.04HSPITakhistov, Misharev, et al., 1995
C11H13S+[(CH3)3CC6H4CS+]9.54C4H9PITakhistov, Misharev, et al., 1995
C14H19S+8.74CH3PITakhistov, Misharev, et al., 1995

References

Takhistov, Misharev, et al., 1995
Takhistov, V.V.; Misharev, A.D.; Orlov, V.M.; Ponomarev, D.A.; Voss, J., Thermochemistry and mass spectrometry of aromatic compounds with tertiary alkyl groups, Eur. Mass Spectrom., 1995, 1, 353. [all data]