Trivinylborane
- Formula: C6H9B
- Molecular weight: 91.947
- IUPAC Standard InChIKey: ZGBHPZUKKNSAOS-UHFFFAOYSA-N
- CAS Registry Number: 7217-01-8
- Chemical structure:
View 3d structure (requires JavaScript / HTML 5) - Permanent link for this species. Use this link for bookmarking this species for future reference.

Gas phase ion energetics data

Data compiled by: Sharon G. Lias, Rhoda D. Levin, and Sherif A. Kafafi
Ionization energy determinations
IE (eV) | Method | Reference |
---|---|---|
9.7 | PE | Holliday, Reade, et al., 1971 |

References

Holliday, Reade, et al., 1971
Holliday, A.K.; Reade, W.; Johnstone, R.A.W.; Neville, A.F.,
Photo-electron spectrum of trivinylboron,
Chem. Commun., 1971, 51. [all data]