1[(4-Chlorophenyl)methyl]pyridinium
- Formula: C12H11ClN
- Molecular weight: 204.675
- IUPAC Standard InChIKey: GDGNYUXBILMTKL-UHFFFAOYSA-N
- CAS Registry Number: 71897-27-3
- Chemical structure:
View 3d structure (requires JavaScript / HTML 5) - Permanent link for this species. Use this link for bookmarking this species for future reference.

Gas phase ion energetics data

Data compiled by: Sharon G. Lias and Joel F. Liebman
Appearance energy determinations
Ion | AE (eV) | Other Products | Method | Reference | Comment |
---|---|---|---|---|---|
C7H6Cl+[4-ClC6H4CH2+] | 1.5 ± 0.35 | C5H5N | N/A | Katritzky, Watson, et al., 1990 |

References

Katritzky, Watson, et al., 1990
Katritzky, A.R.; Watson, C.H.; Dega-Szafran, Z.; Eyler, J.R.,
Collisionally activated dissociation of N-alkylpyridinium cations to pyridine and alkyl cations in the gas phase,
J. Am. Chem. Soc., 1990, 112, 2471. [all data]