Propane, 2-isocyano-2-methyl-
- Formula: C5H9N
- Molecular weight: 83.1317
- IUPAC Standard InChIKey: FAGLEPBREOXSAC-UHFFFAOYSA-N
- CAS Registry Number: 7188-38-7
- Chemical structure:
View 3d structure (requires JavaScript / HTML 5) - Other names: tert-Butyl Isocyanide; tert-Butylisonitrile; (CH3)3CNC; t-Butyl isocyanide; TBIN; 2-Methyl-2-isocyanopropane; 2-methylpropyl isocyanide

Gas phase ion energetics data

Data evaluated as indicated in comments:
HL - Edward P. Hunter and Sharon G. Lias
Data compiled as indicated in comments:
RDSH - Henry M. Rosenstock, Keith Draxl, Bruce W. Steiner, and John T. Herron
Quantity | Value | Units | Method | Reference | Comment |
---|---|---|---|---|---|
Proton affinity (review) | 870.7 | kJ/mol | N/A | Hunter and Lias, 1998 | HL |
Quantity | Value | Units | Method | Reference | Comment |
Gas basicity | 838.3 | kJ/mol | N/A | Hunter and Lias, 1998 | HL |
Ionization energy determinations
IE (eV) | Method | Reference | Comment |
---|---|---|---|
10.50 | EI | Heerma and deRidder, 1970 | RDSH |
Appearance energy determinations
Ion | AE (eV) | Other Products | Method | Reference | Comment |
---|---|---|---|---|---|
C4H9+ | 12.15 | CN | EI | Heerma and deRidder, 1970 | RDSH |

Phase change data

Data compiled as indicated in comments:
BS - Robert L. Brown and Stephen E. Stein
TRC - Thermodynamics Research Center, NIST Boulder Laboratories, Chris Muzny director
Quantity | Value | Units | Method | Reference | Comment |
---|---|---|---|---|---|
Tboil | 365. | K | N/A | American Tokyo Kasei, 1988 | BS |
Quantity | Value | Units | Method | Reference | Comment |
Tfus | 364. to 364.7 | K | N/A | George and Pauling, 1951 | Uncertainty assigned by TRC = 4. K; TRC |

References

Hunter and Lias, 1998
Hunter, E.P.; Lias, S.G.,
Evaluated Gas Phase Basicities and Proton Affinities of Molecules: An Update,
J. Phys. Chem. Ref. Data, 1998, 27, 3, 413-656, https://doi.org/10.1063/1.556018
. [all data]
Heerma and deRidder, 1970
Heerma, W.; deRidder, J.J.,
The electron-impact induced fragmentation of some alkyl isocyanides and alpha-branched alkyl cyanides,
Org. Mass Spectrom., 1970, 3, 1439. [all data]