1-[(Phenylthio)methyl]pyridinium
- Formula: C12H12NS
- Molecular weight: 202.295
- IUPAC Standard InChIKey: LHMRTNGWGSTIGK-UHFFFAOYSA-N
- CAS Registry Number: 71880-02-9
- Chemical structure:
View 3d structure (requires JavaScript / HTML 5) - Permanent link for this species. Use this link for bookmarking this species for future reference.

Gas phase ion energetics data

Data compiled by: Sharon G. Lias and Joel F. Liebman
Appearance energy determinations
Ion | AE (eV) | Other Products | Method | Reference | Comment |
---|---|---|---|---|---|
C7H7S+[C6H5SCH2+] | 1.4 ± 0.35 | C5H5N | CAD | Katritzky, Watson, et al., 1990 |

References

Katritzky, Watson, et al., 1990
Katritzky, A.R.; Watson, C.H.; Dega-Szafran, Z.; Eyler, J.R.,
Collisionally activated dissociation of N-alkylpyridinium cations to pyridine and alkyl cations in the gas phase,
J. Am. Chem. Soc., 1990, 112, 2471. [all data]