1,6-Dicarbahexaborane(6),2,4-dichloro-

Gas phase ion energetics data

Data compiled by: Sharon G. Lias, Rhoda D. Levin, and Sherif A. Kafafi

Ionization energy determinations

IE (eV) Method Reference Comment
9.38PEBeltram and Fehlner, 1979Vertical value

References

Beltram and Fehlner, 1979
Beltram, G.A.; Fehlner, T.P., Substituent effects in cluster species. 2. Photoelectron spectra of 2- and 2,4-substituted 1,6-dicarba- closo-hexaborane(6), J. Am. Chem. Soc., 1979, 101, 6237. [all data]