9-Chloroanthracene
- Formula: C14H9Cl
- Molecular weight: 212.674
- IUPAC Standard InChIKey: KULLJOPUZUWTMF-UHFFFAOYSA-N
- CAS Registry Number: 716-53-0
- Chemical structure:
View 3d structure (requires JavaScript / HTML 5) - Other names: Anthracene, 9-chloro-

Phase change data

Data compiled by: William E. Acree, Jr., James S. Chickos
Enthalpy of fusion
ΔfusH (kJ/mol) | Temperature (K) | Reference |
---|---|---|
18.66 | 379.2 | Guarini and Sarti-fantoni, 1969 |

Gas phase ion energetics data

Data compiled as indicated in comments:
LBLHLM - Sharon G. Lias, John E. Bartmess, Joel F. Liebman, John L. Holmes, Rhoda D. Levin, and W. Gary Mallard
LLK - Sharon G. Lias, Rhoda D. Levin, and Sherif A. Kafafi
B - John E. Bartmess
Electron affinity determinations
EA (eV) | Method | Reference | Comment |
---|---|---|---|
0.86 ± 0.10 | IMRE | Heinis, Chowdhury, et al., 1993 | ΔGea(423 K)= -18.7 kcal/mol , ΔSea=-2.7 (entropy estimated); B |
Ionization energy determinations
IE (eV) | Method | Reference | Comment |
---|---|---|---|
7.45 ± 0.03 | PE | Klasinc, Kovac, et al., 1983 | LBLHLM |
7.45 ± 0.03 | PE | Klasinc, Kovac, et al., 1978 | Vertical value; LLK |

References

Guarini and Sarti-fantoni, 1969
Guarini, G.; Sarti-fantoni, P.,
Calorimetric Study on Some Anthracene Photodimers,
Molecular Crystals, 1969, 6, 3-4, 423-426, https://doi.org/10.1080/15421407008083478
. [all data]
Heinis, Chowdhury, et al., 1993
Heinis, T.; Chowdhury, S.; Kebarle, P.,
Electron Affinities of Naphthalene, Anthracene and Substituted Naphthalenes and Anthracenes,
Org. Mass Spectrom., 1993, 28, 4, 358, https://doi.org/10.1002/oms.1210280416
. [all data]
Klasinc, Kovac, et al., 1983
Klasinc, L.; Kovac, B.; Gusten, H.,
Photoelectron spectra of acenes. Electronic structure and substituent effects,
Pure Appl. Chem., 1983, 55, 289. [all data]
Klasinc, Kovac, et al., 1978
Klasinc, L.; Kovac, B.; Schoof, S.; Gusten, H.,
Photoelectron spectroscopy of 9-substituted anthracenes,
Croat. Chem. Acta., 1978, 51, 307. [all data]