1,4-Cycloheptadiene
- Formula: C7H10
- Molecular weight: 94.1543
- IUPAC Standard InChIKey: HQGYGGZHZWXFSI-UHFFFAOYSA-N
- CAS Registry Number: 7161-35-5
- Chemical structure:
View 3d structure (requires JavaScript / HTML 5) - Permanent link for this species. Use this link for bookmarking this species for future reference.

Reaction thermochemistry data

Data compiled by: Hussein Y. Afeefy, Joel F. Liebman, and Stephen E. Stein
Individual Reactions
By formula: 2H2 + C7H10 = C7H14
Quantity | Value | Units | Method | Reference | Comment |
---|---|---|---|---|---|
ΔrH° | -234. ± 3. | kJ/mol | Chyd | Turner, Mallon, et al., 1973 | liquid phase; solvent: Glacial acetic acid |

Gas phase ion energetics data

Data compiled as indicated in comments:
RDSH - Henry M. Rosenstock, Keith Draxl, Bruce W. Steiner, and John T. Herron
Ionization energy determinations
IE (eV) | Method | Reference | Comment |
---|---|---|---|
8.85 ± 0.03 | PI | Demeo and El-Sayed, 1970 | RDSH |

Kovats' RI, non-polar column, isothermal

Column type | Active phase | Temperature (C) | I | Reference | Comment |
---|---|---|---|---|---|
Capillary | Squalane | 42.5 | 784. | Engewald, Epsch, et al., 1974 | N2; Column length: 100. m; Column diameter: 0.23 mm |

References

Turner, Mallon, et al., 1973
Turner, R.B.; Mallon, B.J.; Tichy, M.; Doering, W.v.E.; Roth, W.R.; Schroder, G.,
Heats of hydrogenation. X. Conjugative interaction in cyclic dienes and trienes,
J. Am. Chem. Soc., 1973, 95, 8605-8610. [all data]
Demeo and El-Sayed, 1970
Demeo, D.A.; El-Sayed, M.A.,
Ionization potential and structure of olefins,
J. Chem. Phys., 1970, 52, 2622. [all data]
Engewald, Epsch, et al., 1974
Engewald, W.; Epsch, K.; Graefe, J.; Welsch, Th.,
Molekülstruktur und retentionsverhalten. II. Retentionsverhalten cycloaliphatischer kohlenwasser-stoffe bei der gas-adsorptions- und gas-verteilungschromatographie,
J. Chromatogr., 1974, 91, 623-631, https://doi.org/10.1016/S0021-9673(01)97943-9
. [all data]