Molybdenum,(chromium)tetraacetate
- Formula: C8H12CrMoO8
- Molecular weight: 384.13
- CAS Registry Number: 71561-64-3

Phase change data

Data compiled by: José A. Martinho Simões
Quantity | Value | Units | Method | Reference | Comment |
---|---|---|---|---|---|
ΔsubH° | 165.0 ± 8.4 | kJ/mol | RSC | Pilcher and Skinner, 1982 |

Gas phase ion energetics data

Data compiled by: Sharon G. Lias, Rhoda D. Levin, and Sherif A. Kafafi
Ionization energy determinations
IE (eV) | Method | Reference | Comment |
---|---|---|---|
7.06 ± 0.05 | PE | Coleman, Green, et al., 1979 | Vertical value |

Condensed phase thermochemistry data

Data compiled by: José A. Martinho Simões
Quantity | Value | Units | Method | Reference | Comment |
---|---|---|---|---|---|
ΔfH°solid | -504.7 ± 2.0 | kcal/mol | Review | Martinho Simões |

Gas phase thermochemistry data

Data compiled by: José A. Martinho Simões
Quantity | Value | Units | Method | Reference | Comment |
---|---|---|---|---|---|
ΔfH°gas | -465.3 ± 2.8 | kcal/mol | Review | Martinho Simões |

References

Pilcher and Skinner, 1982
Pilcher, G.; Skinner, H.A.,
In The Chemistry of the Metal-Carbon Bond Wiley: New York, Hartley, F. R.; Patai, S., ed(s)., 1982. [all data]
Coleman, Green, et al., 1979
Coleman, A.W.; Green, J.C.; Hayes, A.J.; Seddon, E.A.; Lloyd, D.R.; Niwa, Y.,
A comparison of the electronic structure of some group 6A dimetal tetracarboxylates using photoelectron spectroscopy,
J. Chem. Soc. Dalton Trans., 1979, 75, 1057. [all data]