Ethane, 1,1,1-trichloro-
- Formula: C2H3Cl3
- Molecular weight: 133.404
- IUPAC Standard InChIKey: UOCLXMDMGBRAIB-UHFFFAOYSA-N
- CAS Registry Number: 71-55-6
- Chemical structure:
View 3d structure (requires JavaScript / HTML 5) - Species with the same structure:
- Other names: α-Trichloroethane; Aerothene TT; Chlorotene; Chlorothane NU; Chlorothene; Chlorothene NU; Chlorothene VG; Chlorten; Inhibisol; Methylchloroform; Methyltrichloromethane; Trichloroethane; 1,1,1-Trichloroethane; CH3CCl3; α-T; Chloroethene NU; Chloroform, methyl-; NCI-C04626; Solvent 111; Trichloro-1,1,1-ethane; 1,1,1-Trichloraethan; 1,1,1-Tricloroetano; CF 2; Chloroetene; Chloroethene; Chlorothene SM; Ethana NU; ICI-CF 2; Rcra waste number U226; Tafclean; 1,1,1-TCE; Trichloromethylmethane; Tri-ethane; UN 2831; 1,1,1-Trichlorethane; Distillex DS1; Ethana; Solvethane; Cleanite; F 140a; Genklene LB; HCC 140a; Three One A; Three One S

Gas phase thermochemistry data

Data compiled as indicated in comments:
DRB - Donald R. Burgess, Jr.
ALS - Hussein Y. Afeefy, Joel F. Liebman, and Stephen E. Stein
Quantity | Value | Units | Method | Reference | Comment |
---|---|---|---|---|---|
ΔfH°gas | -145. ± 2. | kJ/mol | Review | Manion, 2002 | derived from recommended ΔfHliquid° and ΔvapH°; DRB |
ΔfH°gas | -144.4 ± 1.6 | kJ/mol | Ccb | Hu, Sinke, et al., 1972 | Reanalyzed by Cox and Pilcher, 1970, Original value = -146.0 ± 0.84 kJ/mol; see Hu and Sinke, 1969; ALS |
ΔfH°gas | -142.3 ± 1.4 | kJ/mol | Ccr | Mansson, Ringner, et al., 1971 | ALS |

Condensed phase thermochemistry data

Data compiled as indicated in comments:
DRB - Donald R. Burgess, Jr.
ALS - Hussein Y. Afeefy, Joel F. Liebman, and Stephen E. Stein
DH - Eugene S. Domalski and Elizabeth D. Hearing
Quantity | Value | Units | Method | Reference | Comment |
---|---|---|---|---|---|
ΔfH°liquid | -177. ± 2. | kJ/mol | Review | Manion, 2002 | weighted average of several measurements; DRB |
ΔfH°liquid | -174. | kJ/mol | Eqk | Levanova, Treger, et al., 1975 | Flow reactor at 50°C; ALS |
ΔfH°liquid | -178.6 ± 0.84 | kJ/mol | Ccb | Hu, Sinke, et al., 1972 | Reanalyzed by Cox and Pilcher, 1970, Original value = -176. ± 0.79 kJ/mol; see Hu and Sinke, 1969; ALS |
ΔfH°liquid | -174.8 ± 1.4 | kJ/mol | Ccr | Mansson, Ringner, et al., 1971 | ALS |
Quantity | Value | Units | Method | Reference | Comment |
ΔcH°liquid | -1108.0 ± 0.79 | kJ/mol | Ccb | Hu, Sinke, et al., 1972 | see Hu and Sinke, 1969; ALS |
ΔcH°liquid | -1112.1 ± 1.3 | kJ/mol | Ccr | Mansson, Ringner, et al., 1971 | ALS |
Quantity | Value | Units | Method | Reference | Comment |
S°liquid | 226.7 | J/mol*K | N/A | Andon, Counsell, et al., 1973 | DH |
S°liquid | 227.48 | J/mol*K | N/A | Rubin, Levedahl, et al., 1944 | DH |
Constant pressure heat capacity of liquid
Cp,liquid (J/mol*K) | Temperature (K) | Reference | Comment |
---|---|---|---|
144.4 | 298.15 | Andon, Counsell, et al., 1973 | T = 10 to 310 K.; DH |
138.9 | 257.29 | Crowe and Smyth, 1950 | T = 117 to 260 K. Value is unsmoothed experimental datum.; DH |
144.31 | 299.59 | Rubin, Levedahl, et al., 1944 | T = 12 to 300 K. Value is unsmoothed experimental datum.; DH |
Constant pressure heat capacity of solid
Cp,solid (J/mol*K) | Temperature (K) | Reference | Comment |
---|---|---|---|
123. | 225. | Martin and Monti, 1988 | T = 10 to 225 K. Data given graphically and estimated from graph.; DH |

Phase change data

Data compiled as indicated in comments:
TRC - Thermodynamics Research Center, NIST Boulder Laboratories, Chris Muzny director
BS - Robert L. Brown and Stephen E. Stein
DRB - Donald R. Burgess, Jr.
AC - William E. Acree, Jr., James S. Chickos
ALS - Hussein Y. Afeefy, Joel F. Liebman, and Stephen E. Stein
DH - Eugene S. Domalski and Elizabeth D. Hearing
CAL - James S. Chickos, William E. Acree, Jr., Joel F. Liebman, Students of Chem 202 (Introduction to the Literature of Chemistry), University of Missouri -- St. Louis
Quantity | Value | Units | Method | Reference | Comment |
---|---|---|---|---|---|
Tboil | 347.2 ± 0.2 | K | AVG | N/A | Average of 13 out of 15 values; Individual data points |
Quantity | Value | Units | Method | Reference | Comment |
Tfus | 240. ± 7. | K | AVG | N/A | Average of 9 values; Individual data points |
Quantity | Value | Units | Method | Reference | Comment |
Ttriple | 243.13 | K | N/A | Andon, Counsell, et al., 1973, 2 | Crystal phase 1 phase; Uncertainty assigned by TRC = 0.02 K; TRC |
Ttriple | 240.1 | K | N/A | Crowe and Smyth, 1950, 2 | Crystal phase 1 phase; Uncertainty assigned by TRC = 0.2 K; TRC |
Ttriple | 240.2 | K | N/A | Rubin, Levedahl, et al., 1944, 2 | Crystal phase 1 phase; Uncertainty assigned by TRC = 0.2 K; TRC |
Quantity | Value | Units | Method | Reference | Comment |
Tc | 548.4 | K | N/A | Majer and Svoboda, 1985 | |
Quantity | Value | Units | Method | Reference | Comment |
ΔvapH° | 32.5 ± 0.1 | kJ/mol | AVG | N/A | Average of 6 values; Individual data points |
Enthalpy of vaporization
ΔvapH (kJ/mol) | Temperature (K) | Method | Reference | Comment |
---|---|---|---|---|
29.86 | 347.2 | N/A | Majer and Svoboda, 1985 | |
33.313 | 286.53 | N/A | Rubin, Levedahl, et al., 1944 | P = 10.26 kPa; DH |
32.3 | 310. | A | Stephenson and Malanowski, 1987 | Based on data from 295. to 372. K.; AC |
30.5 | 364. | A | Stephenson and Malanowski, 1987 | Based on data from 349. to 408. K.; AC |
29.4 | 414. | A | Stephenson and Malanowski, 1987 | Based on data from 399. to 487. K.; AC |
29.5 | 494. | A | Stephenson and Malanowski, 1987 | Based on data from 479. to 545. K.; AC |
32.4 | 344. | N/A | Rao and Viswanath, 1977 | AC |
37.6 | 211. | N/A | Ambrose, Sprake, et al., 1973 | Based on data from 196. to 298. K.; AC |
33.4 | 279. | N/A | Rubin, Levedahl, et al., 1944 | Based on data from 268. to 290. K.; AC |
33.4 ± 0.1 | 284. | C | Rubin, Levedahl, et al., 1944 | AC |
Entropy of vaporization
ΔvapS (J/mol*K) | Temperature (K) | Reference | Comment |
---|---|---|---|
116.26 | 286.53 | Rubin, Levedahl, et al., 1944 | P; DH |
Antoine Equation Parameters
log10(P) = A − (B / (T + C))
P = vapor pressure (bar)
T = temperature (K)
View plot Requires a JavaScript / HTML 5 canvas capable browser.
Temperature (K) | A | B | C | Reference | Comment |
---|---|---|---|---|---|
267.79 to 290.07 | 5.88607 | 2210.179 | 34.902 | Rubin, Levedahl, et al., 1944 | Coefficents calculated by NIST from author's data. |
Enthalpy of fusion
ΔfusH (kJ/mol) | Temperature (K) | Reference | Comment |
---|---|---|---|
1.88 | 240.1 | Andon, Counsell, et al., 1973, 2 | See also Domalski and Hearing, 1996.; AC |
Entropy of fusion
ΔfusS (J/mol*K) | Temperature (K) | Reference | Comment |
---|---|---|---|
1.02 | 205. | Domalski and Hearing, 1996 | CAL |
33.31 | 223.6 | ||
7.84 | 240.1 | ||
33.3 | 224.2 | ||
7.8 | 240.2 | ||
33.3 | 224.8 | ||
9.67 | 243.1 |
Temperature of phase transition
Ttrs (K) | Initial Phase | Final Phase | Reference | Comment |
---|---|---|---|---|
225.0 | crystaline, II | crystaline, Ib | Hasebe and Yoshida, 1991 | DH |
236.7 | crystaline, Ia | liquid | Hasebe and Yoshida, 1991 | DH |
242.90 | crystaline, Ib | liquid | Hasebe and Yoshida, 1991 | DH |
Enthalpy of phase transition
ΔHtrs (kJ/mol) | Temperature (K) | Initial Phase | Final Phase | Reference | Comment |
---|---|---|---|---|---|
7.490 | 224.80 | crystaline, II | crystaline, I | Andon, Counsell, et al., 1973 | DH |
2.350 | 243.13 | crystaline, I | liquid | Andon, Counsell, et al., 1973 | DH |
7.473 | 224.20 | crystaline, II | crystaline, I | Rubin, Levedahl, et al., 1944 | DH |
1.880 | 240.2 | crystaline, I | liquid | Rubin, Levedahl, et al., 1944 | H estimated because of errors in Cp above 225 K. Not used in calulation of entropy.; DH |
7.470 | 224.5 | crystaline, II | crystaline, I | Martin, 1982 | DH |
1.550 | 240.9 | crystaline, I | liquid | Martin, 1982 | DH |
0.210 | 205. | crystaline, III | crystaline, II | Crowe and Smyth, 1950 | DH |
7.450 | 223.6 | crystaline, II | crystaline, I | Crowe and Smyth, 1950 | DH |
1.880 | 240.1 | crystaline, I | liquid | Crowe and Smyth, 1950 | DH |
Entropy of phase transition
ΔStrs (J/mol*K) | Temperature (K) | Initial Phase | Final Phase | Reference | Comment |
---|---|---|---|---|---|
33.32 | 224.80 | crystaline, II | crystaline, I | Andon, Counsell, et al., 1973 | DH |
9.67 | 243.13 | crystaline, I | liquid | Andon, Counsell, et al., 1973 | DH |
33.33 | 224.20 | crystaline, II | crystaline, I | Rubin, Levedahl, et al., 1944 | DH |
7.8 | 240.2 | crystaline, I | liquid | Rubin, Levedahl, et al., 1944 | H; DH |
33.3 | 224.5 | crystaline, II | crystaline, I | Martin, 1982 | DH |
6.43 | 240.9 | crystaline, I | liquid | Martin, 1982 | DH |
1.0 | 205. | crystaline, III | crystaline, II | Crowe and Smyth, 1950 | DH |
33.3 | 223.6 | crystaline, II | crystaline, I | Crowe and Smyth, 1950 | DH |
7.8 | 240.1 | crystaline, I | liquid | Crowe and Smyth, 1950 | DH |

Reaction thermochemistry data

Data compiled by: Hussein Y. Afeefy, Joel F. Liebman, and Stephen E. Stein
Individual Reactions
By formula: C2H3Cl3 = C2H2Cl2 + HCl
Quantity | Value | Units | Method | Reference | Comment |
---|---|---|---|---|---|
ΔrH° | 56.9 | kJ/mol | Eqk | Levanova, Bushneva, et al., 1979 | liquid phase |
ΔrH° | 49.0 | kJ/mol | Eqk | Levanova, Bushneva, et al., 1979 | gas phase |
ΔrH° | 56.9 ± 2.1 | kJ/mol | Eqk | Levanova, Treger, et al., 1975 | liquid phase; solvent: Nitrobenzene; Flow reactor at 50°C |
By formula: C2H2Cl2 + HCl = C2H3Cl3
Quantity | Value | Units | Method | Reference | Comment |
---|---|---|---|---|---|
ΔrH° | -54.64 ± 0.84 | kJ/mol | Eqk | Hu, Sinke, et al., 1972 | gas phase; Heat of halogenation at 348-399 K |
By formula: C2H3Cl3 = C2H3Cl3
Quantity | Value | Units | Method | Reference | Comment |
---|---|---|---|---|---|
ΔrH° | 8.4 | kJ/mol | Ciso | Levanova, Treger, et al., 1975, 2 | gas phase |

Henry's Law data

Data compiled by: Rolf Sander
Henry's Law constant (water solution)
kH(T) = k°H exp(d(ln(kH))/d(1/T) ((1/T) - 1/(298.15 K)))
k°H = Henry's law constant for solubility in water at 298.15 K (mol/(kg*bar))
d(ln(kH))/d(1/T) = Temperature dependence constant (K)
k°H (mol/(kg*bar)) | d(ln(kH))/d(1/T) (K) | Method | Reference | Comment |
---|---|---|---|---|
0.058 | 3900. | L | N/A | |
0.068 | 3800. | M | N/A | |
0.060 | 3100. | M | N/A | |
0.071 | 4700. | C | N/A | |
0.059 | 3200. | X | N/A | |
0.053 | M | N/A | ||
0.057 | 3200. | M | N/A | |
0.087 | X | N/A | Value given here as cited in missing citation. | |
0.063 | 3700. | X | N/A | |
0.061 | 3500. | M | N/A | |
0.058 | 3400. | X | N/A | |
0.051 | 5200. | X | N/A | |
0.057 | 3400. | X | N/A | |
0.058 | 4000. | X | Barr and Newsham, 1987 | |
0.059 | 4100. | M | Gossett, 1987 | |
0.059 | 4100. | X | N/A | |
0.058 | 4200. | X | N/A | |
0.059 | 4300. | X | N/A | |
0.059 | 4300. | M | N/A | |
0.077 | 3200. | M | N/A | |
0.22 | 1700. | X | N/A | |
0.050 | 4400. | X | Leighton and Calo, 1981 | |
0.036 | L | N/A | ||
0.027 | 7000. | X | N/A | |
0.11 | 4600. | X | N/A | |
0.034 | V | N/A | ||
0.040 | V | N/A | Value at T = 293. K. | |
0.11 | V | N/A | Value at T = 275. K. | |
0.062 | V | N/A | ||
0.029 | M | Pearson and McConnell, 1975 | The same data was also published in missing citation. Value at T = 293. K. |

Gas phase ion energetics data

Data compiled as indicated in comments:
LLK - Sharon G. Lias, Rhoda D. Levin, and Sherif A. Kafafi
LL - Sharon G. Lias and Joel F. Liebman
Ionization energy determinations
IE (eV) | Method | Reference | Comment |
---|---|---|---|
11.0 | PE | Katsumata and Kimura, 1975 | LLK |
11.25 | PE | Katsumata and Kimura, 1975 | Vertical value; LLK |
Appearance energy determinations
Ion | AE (eV) | Other Products | Method | Reference | Comment |
---|---|---|---|---|---|
CCl3+ | 11.78 | CH3 | EI | Hop, Holmes, et al., 1988 | LL |

Kovats' RI, non-polar column, isothermal

Column type | Active phase | Temperature (C) | I | Reference | Comment |
---|---|---|---|---|---|
Capillary | OV-1 | 70. | 637. | Annino and Villalobos, 1999 | 22.6 m/0.53 mm/2.78 μm |
Capillary | DB-1 | 60. | 639. | Dewulf, Van Langenhove, et al., 1997 | 30. m/0.53 mm/5.0 μm, He |
Capillary | OV-1 | 50. | 637. | Villalobos, 1995 | 30. m/0.32 mm/0.96 μm |
Packed | OV-1 | 100. | 646. | Castello and Gerbino, 1988 | He, Chromosorb W DMCS; Column length: 3. m |
Packed | OV-1 | 125. | 651. | Castello and Gerbino, 1988 | He, Chromosorb W DMCS; Column length: 3. m |
Packed | OV-1 | 75. | 640. | Castello and Gerbino, 1988 | He, Chromosorb W DMCS; Column length: 3. m |
Packed | SE-30 | 100. | 650. | Winskowski, 1983 | Gaschrom Q; Column length: 2. m |
Packed | Porapack Q | 200. | 621. | Goebel, 1982 | N2 |

Kovats' RI, non-polar column, temperature ramp

Column type | Active phase | I | Reference | Comment |
---|---|---|---|---|
Capillary | CBP-1 | 637. | Shimadzu, 2003 | 25. m/0.2 mm/0.25 μm, He, 50. C @ 5. min, 4. K/min; Tend: 200. C |

Kovats' RI, polar column, isothermal

Column type | Active phase | Temperature (C) | I | Reference | Comment |
---|---|---|---|---|---|
Capillary | Carbowax 20M | 70. | 898. | Annino and Villalobos, 1999 | 31.3 m/0.53 mm/0.54 μm |
Capillary | Carbowax 20M | 50. | 898. | Villalobos, 1995 | 30. m/0.32 mm/0.54 μm, He |
Packed | SP-1000 | 100. | 904.35 | Castello and Gerbino, 1988 | He, Chromosorb W DMCS; Column length: 3. m |
Packed | SP-1000 | 125. | 909.11 | Castello and Gerbino, 1988 | He, Chromosorb W DMCS; Column length: 3. m |
Packed | SP-1000 | 75. | 897.56 | Castello and Gerbino, 1988 | He, Chromosorb W DMCS; Column length: 3. m |
Packed | Carbowax 20M | 75. | 891. | Goebel, 1982 | N2, Kieselgur (60-100 mesh); Column length: 2. m |

Kovats' RI, polar column, temperature ramp

Column type | Active phase | I | Reference | Comment |
---|---|---|---|---|
Capillary | CBP-20 | 885. | Shimadzu, 2003 | 25. m/0.2 mm/0.25 μm, He, 50. C @ 5. min, 4. K/min; Tend: 200. C |

Van Den Dool and Kratz RI, non-polar column, temperature ramp

Column type | Active phase | I | Reference | Comment |
---|---|---|---|---|
Capillary | DB-5 | 642.4 | Xu, van Stee, et al., 2003 | 30. m/0.25 mm/1. μm, He, 2.5 K/min; Tstart: 50. C; Tend: 200. C |
Capillary | DB-1 | 623.5 | Helmig, Pollock, et al., 1996 | 30. m/0.25 mm/1. μm, 6. K/min; Tstart: -50. C; Tend: 180. C |
Capillary | DB-5 | 645.1 | Helmig, Pollock, et al., 1996 | 60. m/0.33 mm/0.25 μm, 6. K/min; Tstart: -50. C; Tend: 180. C |
Capillary | Petrocol DH | 628. | White, Hackett, et al., 1992 | 100. m/0.25 mm/0.5 μm, He, 1. K/min; Tstart: 30. C; Tend: 220. C |
Capillary | SE-54 | 645. | Weber, 1986 | 25. m/0.31 mm/0.17 μm, H2, 2. K/min; Tstart: 35. C |
Packed | OV-101 | 660.0 | Zilka and Matucha, 1978 | Ar, Supelcoport, 8. K/min; Column length: 2. m; Tstart: 40. C |
Packed | SE-30 | 628.6 | Zilka and Matucha, 1978 | Ar, Chromaton N-AW-DMCS, 8. K/min; Column length: 2. m; Tstart: 40. C |

Normal alkane RI, non-polar column, isothermal

Column type | Active phase | Temperature (C) | I | Reference | Comment |
---|---|---|---|---|---|
Capillary | DB-1 | 60. | 641. | Shimadzu, 2003, 2 | 60. m/0.32 mm/1. μm, He |

Normal alkane RI, non-polar column, temperature ramp

Column type | Active phase | I | Reference | Comment |
---|---|---|---|---|
Capillary | BP-1 | 634. | Health Safety Executive, 2000 | 50. m/0.22 mm/0.75 μm, He, 5. K/min; Tstart: 50. C; Tend: 200. C |
Capillary | DB-1 | 634. | Ciccioli, Cecinato, et al., 1992 | 60. m/0.32 mm/1.2 μm, He, 30. C @ 10. min, 3. K/min; Tend: 240. C |
Capillary | DB-1 | 628. | Habu, Flath, et al., 1985 | 3. K/min; Column length: 50. m; Column diameter: 0.32 mm; Tstart: 0. C; Tend: 250. C |

Normal alkane RI, non-polar column, custom temperature program

Column type | Active phase | I | Reference | Comment |
---|---|---|---|---|
Capillary | Polydimethyl siloxanes | 636. | Zenkevich, Eliseenkov, et al., 2006 | Program: not specified |
Capillary | BP-1 | 625.98 | Cooke, Hassoun, et al., 2001 | 50. m/0.25 mm/1. μm, He; Program: -50C => 49.9C/min => 5C(3min) => 3C/min => 50C => 5C/min => 220C(20 min) |
Capillary | Methyl Silicone | 636. | Zenkevich, 2001 | Program: not specified |
Capillary | Methyl Silicone | 639. | Zenkevich, 2001 | Program: not specified |
Capillary | SPB-1 | 639. | Flanagan, Streete, et al., 1997 | 60. m/0.53 mm/5. μm, He; Program: 40C(6min) => 5C/min => 80C => 10C/min => 200C |
Capillary | DB-5 | 650. | Sorimachi, Tanabe, et al., 1995 | He; Column length: 30. m; Program: not specified |
Capillary | DB-1 | 626. | Ciccioli, Cecinato, et al., 1994 | 60. m/0.32 mm/0.25 μm; Program: not specified |
Capillary | DB-1 | 626. | Ciccioli, Brancaleoni, et al., 1993 | 60. m/0.32 mm/0.25 μm; Program: 3 min at 5 C; 5 - 50 C at 3 deg/min; 50 - 220 C at 5 deg/min |
Capillary | SPB-1 | 639. | Strete, Ruprah, et al., 1992 | 60. m/0.53 mm/5.0 μm, Helium; Program: 40 0C (6 min) 5 0C/min -> 80 0C 10 0C/min -> 200 0C |
Capillary | SPB-1 | 634. | Strete, Ruprah, et al., 1992 | 60. m/0.53 mm/5.0 μm, Helium; Program: not specified |
Capillary | DB-1 | 621. | Takeoka, Flath, et al., 1988 | 30. m/0.25 mm/0.25 μm, H2; Program: 30C (2min) => 2C/min => 150C => 4C/min => 250C |
Capillary | DB-1 | 629. | Takeoka, Flath, et al., 1988 | 30. m/0.25 mm/0.25 μm, H2; Program: 30C (2min) => 2C/min => 150C => 4C/min => 250C |
Capillary | OV-1, SE-30, Methyl silicone, SP-2100, OV-101, DB-1, etc. | 632. | Waggott and Davies, 1984 | Hydrogen; Column length: 50. m; Column diameter: 0.32 mm; Program: not specified |
Capillary | OV-1, SE-30, Methyl silicone, SP-2100, OV-101, DB-1, etc. | 650. | Waggott and Davies, 1984 | Hydrogen; Column length: 50. m; Column diameter: 0.32 mm; Program: not specified |
Capillary | OV-1 | 634. | Ramsey and Flanagan, 1982 | Program: not specified |
Capillary | SE-30 | 630. | Heydanek and McGorrin, 1981 | He; Column length: 50. m; Column diameter: 0.5 mm; Program: -10C (8min) => 12C/min => 26C => 3C/min => 170C (30min) |

Normal alkane RI, polar column, isothermal

Column type | Active phase | Temperature (C) | I | Reference | Comment |
---|---|---|---|---|---|
Capillary | DB-Wax | 60. | 908. | Shimadzu, 2003, 2 | 50. m/0.32 mm/1. μm, He |

Normal alkane RI, polar column, temperature ramp

Column type | Active phase | I | Reference | Comment |
---|---|---|---|---|
Capillary | DB-Wax | 900. | Shimadzu, 2012 | 30. m/0.32 mm/0.50 μm, Helium, 4. K/min; Tstart: 40. C; Tend: 260. C |
Capillary | DB-Wax | 900. | Shimadzu Corporation, 2003 | 30. m/0.32 mm/0.5 μm, He, 4. K/min; Tstart: 40. C; Tend: 260. C |

Normal alkane RI, polar column, custom temperature program

Column type | Active phase | I | Reference | Comment |
---|---|---|---|---|
Capillary | Carbowax 20M | 886. | Ramsey and Flanagan, 1982 | Program: not specified |

References

Manion, 2002
Manion, J.A.,
Evaluated Enthalpies of Formation of the Stable Closed Shell C1 and C2 Chlorinated Hydrocarbons,
J. Phys. Chem. Ref. Data, 2002, 31, 1, 123-172, https://doi.org/10.1063/1.1420703
. [all data]
Hu, Sinke, et al., 1972
Hu, A.T.; Sinke, G.C.; Mintz, M.J.,
The enthalpy of formation of 1,1,1-trichloroethane from enthalpy of combustion and equilibrium studies,
J. Chem. Thermodyn., 1972, 4, 239-245. [all data]
Cox and Pilcher, 1970
Cox, J.D.; Pilcher, G.,
Thermochemistry of Organic and Organometallic Compounds, Academic Press, New York, 1970, 1-636. [all data]
Hu and Sinke, 1969
Hu, A.T.; Sinke, G.C.,
Combustion calorimetry of some chlorinated organic compounds,
J. Chem. Thermodyn., 1969, 1, 507-513. [all data]
Mansson, Ringner, et al., 1971
Mansson, M.; Ringner, B.; Sunner, S.,
The enthalpies of combustion and formation of some simple chloroalkanes and chloralkenes 1,1,1-trichloroethane and 1,1-dichloroethene,
J. Chem. Thermodyn., 1971, 3, 547-551. [all data]
Levanova, Treger, et al., 1975
Levanova, S.V.; Treger, Yu.A.; Velichko, S.M.; Rozhnov, A.M.; Bshneva, L.I.; Talanov, A.I.,
Equilibrium of the vinylidene chloride-methylchloroform system,
Zh. Prikl. Khim. (Leningrad), 1975, 42, 480-481. [all data]
Andon, Counsell, et al., 1973
Andon, R.J.L.; Counsell, J.F.; Lee, D.A.; Martin, J.F.,
Thermodynamic properties of aliphatic halogen compounds. Part 2. Heat capacity of 1,1,1-trichloroethane,
J. Chem. Soc. Faraday Trans., 1973, I 69, 1721-1726. [all data]
Rubin, Levedahl, et al., 1944
Rubin, T.R.; Levedahl, B.H.; Yost, D.M.,
The heat capacity, heat of transition, vaporization, vapor pressure and entropy of 1,1,1-trichloroethane,
J. Am. Chem. Soc., 1944, 66, 279-282. [all data]
Crowe and Smyth, 1950
Crowe, R.W.; Smyth, C.P.,
Heat capacities, dielectric constants and molecular rotational freedom in solid trichloroethanes and disubstituted propanes,
J. Am. Chem. Soc., 1950, 72, 4009-4015. [all data]
Martin and Monti, 1988
Martin, C.A.; Monti, G.A.,
Specific heat analysis in 1,1,1-trichloroethane,
Thermochim. Acta, 1988, 134, 27-34. [all data]
Andon, Counsell, et al., 1973, 2
Andon, R.J.L.; Counsell, J.F.; Lee, D.A.; Martin, J.F.,
Thermodynamic properties of aliphatic halogen compounds. Part 2.---Heat capacity of 1,1,1-trichloroethane,
J. Chem. Soc., Faraday Trans. 1, 1973, 69, 0, 1721, https://doi.org/10.1039/f19736901721
. [all data]
Crowe and Smyth, 1950, 2
Crowe, R.W.; Smyth, C.P.,
Heat capacities, dielectric constants and molecular rotational freedom in solid trichloroethanes and disubstituted propanes,
J. Am. Chem. Soc., 1950, 72, 4009. [all data]
Rubin, Levedahl, et al., 1944, 2
Rubin, T.R.; Levedahl, B.H.; Yost, D.M.,
The heat capacity, heat of transition, vaporization, vapor pressure and entropy of 1,1,1-trichloroethane,
J. Am. Chem. Soc., 1944, 66, 279. [all data]
Majer and Svoboda, 1985
Majer, V.; Svoboda, V.,
Enthalpies of Vaporization of Organic Compounds: A Critical Review and Data Compilation, Blackwell Scientific Publications, Oxford, 1985, 300. [all data]
Stephenson and Malanowski, 1987
Stephenson, Richard M.; Malanowski, Stanislaw,
Handbook of the Thermodynamics of Organic Compounds, 1987, https://doi.org/10.1007/978-94-009-3173-2
. [all data]
Rao and Viswanath, 1977
Rao, Yaddanapudi J.; Viswanath, Dabir S.,
Integral isobaric heats of vaporization of benzene-chloroethane systems,
J. Chem. Eng. Data, 1977, 22, 1, 36-38, https://doi.org/10.1021/je60072a011
. [all data]
Ambrose, Sprake, et al., 1973
Ambrose, D.; Sprake, C.H.S.; Townsend, R.,
Thermodynamic properties of aliphatic halogen compounds. Part 1.---Vapour pressure and critical properties of 1,1,1-trichloroethane,
J. Chem. Soc., Faraday Trans. 1, 1973, 69, 0, 839, https://doi.org/10.1039/f19736900839
. [all data]
Domalski and Hearing, 1996
Domalski, Eugene S.; Hearing, Elizabeth D.,
Heat Capacities and Entropies of Organic Compounds in the Condensed Phase. Volume III,
J. Phys. Chem. Ref. Data, 1996, 25, 1, 1, https://doi.org/10.1063/1.555985
. [all data]
Hasebe and Yoshida, 1991
Hasebe, T.; Yoshida, M.,
Polymorphism and molecular motions in 1,1,1-trichloroethane. Differential thermal analysis and 1H NMR, Fukushima Daigaku Kyoikugakubu Ronshu,
Rika Hokoku, 1991, 48, 5-8. [all data]
Martin, 1982
Martin, C.A.,
Specific heat anomalies in some organic compounds, Therm. Anal., Proc. Int. Conf.,
7th, 1982, 2, 829-835. [all data]
Levanova, Bushneva, et al., 1979
Levanova, s.V.; Bushneva, I.I.; Rodova, R.M.; Rozhnov, A.M.; Treger, Yu.A.; Aprelkin, A.S.,
Thermodynamic stability of chloroethanes in dehydrochlorination reactions,
J. Appl. Chem. USSR, 1979, 52, 1439-1442. [all data]
Levanova, Treger, et al., 1975, 2
Levanova, S.V.; Treger, Yu.A.; Velichko, S.M.; Rozhnov, A.M.; Khlestkov, A.I.; Pisarev, V.V.,
Liquid-phase hydrochlorination of symmetrical dichloroethylenes,
J. Appl. Chem. USSR, 1975, 48, 1628-1631, In original 1574. [all data]
Barr and Newsham, 1987
Barr, R.S.; Newsham, D.M.T.,
Phase Equilibrtia in Very Dilute Mixtures of Water and Chlorinated Hydrocarbons. Part I - Experimental Results,
Fluid Phase Equilibria, 1987, 35, 189-205. [all data]
Gossett, 1987
Gossett, J.M.,
Measurement of Henry's Law Constants for C1 and C2 Chlorinated Hydrocarbons,
Environ. Sci. Technol., 1987, 21, 202-208. [all data]
Leighton and Calo, 1981
Leighton, D.T.; Calo, J.M.,
Distribution Coefficients of Chlorinated Hydrocarbons in Dilute Air-Water Systems for Groundwater Contamination Applications,
J. Chem. Eng. Data, 1981, 26, 382-385. [all data]
Pearson and McConnell, 1975
Pearson, C.R.; McConnell, G.,
Chlorinated C1 and C2 Hydrocarbons in the Marine Environment,
Proc. R. Soc. London, B, 1975, 189, 305-332. [all data]
Katsumata and Kimura, 1975
Katsumata, S.; Kimura, K.,
Photoelectron spectra and sum rule consideration. Effect of chlorine substitution on ionization energies for chloroethanes, chloroacetaldehydes and chloroacetyl chlorides,
J. Electron Spectrosc. Relat. Phenom., 1975, 6, 309. [all data]
Hop, Holmes, et al., 1988
Hop, C.E.C.A.; Holmes, J.L.; Lossing, F.P.; Terlouw, J.K.,
The stability of [CCl4]+, [Cl2C-Cl-Cl]+, their dications, and neutral counterparts,
Int. J. Mass Spectrom. Ion Processes, 1988, 83, 285. [all data]
Annino and Villalobos, 1999
Annino, R.; Villalobos, R.,
A strategy for the simplification and solution of complex chromatographic analysis problems utilizing two-dimensional mapping of retention indexes followed by computer modeling of heart cuts from serially coupled columns containing different stationary phases,
J. Hi. Res. Chromatogr., 1999, 22, 10, 589-593. [all data]
Dewulf, Van Langenhove, et al., 1997
Dewulf, J.; Van Langenhove, H.; Everaert, M.,
Solid-phase microextraction of volatile organic compounds estimation of the sorption equilibrium from the Kováts index, effect of salinity and humic acids and the study of the kinetics by the development of an agitated/static layer model,
J. Chromatogr. A, 1997, 761, 1-2, 205-217, https://doi.org/10.1016/S0021-9673(96)00810-2
. [all data]
Villalobos, 1995
Villalobos, R.,
A window diagram for key component analysis in on-line gas chromatography,
J. Hi. Res. Chromatogr., 1995, 18, 6, 343-347, https://doi.org/10.1002/jhrc.1240180604
. [all data]
Castello and Gerbino, 1988
Castello, G.; Gerbino, T.C.,
Effect of Temperature on the Gas Chromatographic Separation of Halogenated Compounds on Polar and Non-Polar Stationary Phases,
J. Chromatogr., 1988, 437, 33-45, https://doi.org/10.1016/S0021-9673(00)90369-8
. [all data]
Winskowski, 1983
Winskowski, J.,
Gaschromatographische Identifizierung von Stoffen anhand von Indexziffem und unterschiedlichen Detektoren,
Chromatographia, 1983, 17, 3, 160-165, https://doi.org/10.1007/BF02271041
. [all data]
Goebel, 1982
Goebel, K.-J.,
Gaschromatographische Identifizierung Niedrig Siedender Substanzen Mittels Retentionsindices und Rechnerhilfe,
J. Chromatogr., 1982, 235, 1, 119-127, https://doi.org/10.1016/S0021-9673(00)95793-5
. [all data]
Shimadzu, 2003
Shimadzu,
Gas chromatography analysis of organic solvents using capillary columns (No. 2), 2003, retrieved from http://www.shimadzu.com/apps/form.cfm. [all data]
Xu, van Stee, et al., 2003
Xu, X.; van Stee, L.L.P.; Williams, J.; Beens, J.; Adahchour, M.; Vreuls, R.J.J.; Brinkman, U.A.Th.; Lelieveld, J.,
Comprehensive two-dimensional gas chromatography (GC×GC) measurements of volatile organic compounds in the atmosphere,
Atmos. Chem. Phys., 2003, 3, 3, 665-682, https://doi.org/10.5194/acp-3-665-2003
. [all data]
Helmig, Pollock, et al., 1996
Helmig, D.; Pollock, W.; Greenberg, J.; Zimmerman, P.,
Gas chromatography mass spectrometry analysis of volatile organic trace gases at Mauna Loa Observatory, Hawaii,
J. Geophys. Res., 1996, 101, D9, 14697-14710, https://doi.org/10.1029/96JD00212
. [all data]
White, Hackett, et al., 1992
White, C.M.; Hackett, J.; Anderson, R.R.; Kail, S.; Spock, P.S.,
Linear temperature programmed retention indices of gasoline range hydrocarbons and chlorinated hydrocarbons on cross-linked polydimethylsiloxane,
J. Hi. Res. Chromatogr., 1992, 15, 2, 105-120, https://doi.org/10.1002/jhrc.1240150211
. [all data]
Weber, 1986
Weber, L.,
Utilization of the Sadtler standard RI system in micropollution analyses,
J. Hi. Res. Chromatogr. Chromatogr. Comm., 1986, 9, 8, 446-451, https://doi.org/10.1002/jhrc.1240090806
. [all data]
Zilka and Matucha, 1978
Zilka, L.; Matucha, M.,
Gas chromatographic analysis of chlorinated ethanes,
J. Chromatogr., 1978, 148, 1, 229-235, https://doi.org/10.1016/S0021-9673(00)99342-7
. [all data]
Shimadzu, 2003, 2
Shimadzu,
Gas chromatography analysis of organic solvents using capillary columns (No. 3), 2003, retrieved from http://www.shimadzu.com/apps/form.cfm. [all data]
Health Safety Executive, 2000
Health Safety Executive,
MDHS 96 Volatile organic compounds in air - Laboratory method using pumed solid sorbent tubes, solvent desorption and gas chromatography
in Methods for the Determination of Hazardous Substances (MDHS) guidance, Crown, Colegate, Norwich, 2000, 1-24, retrieved from http://www.hse.gov.uk/pubns/mdhs/pdfs/mdhs96.pdf. [all data]
Ciccioli, Cecinato, et al., 1992
Ciccioli, P.; Cecinato, A.; Brancaleoni, E.; Frattoni, M.; Liberti, A.,
Use of carbon adsorption traps combined with high resolution gas chromatography - mass spectrometry for the analysis of polar and non-polar C4-C14 hydrocarbons involved in photochemical smog formation,
J. Hi. Res. Chromatogr., 1992, 15, 2, 75-84, https://doi.org/10.1002/jhrc.1240150205
. [all data]
Habu, Flath, et al., 1985
Habu, T.; Flath, R.A.; Mon, T.R.; Morton, J.F.,
Volatile components of Rooibos tea (Aspalathus linearis),
J. Agric. Food Chem., 1985, 33, 2, 249-254, https://doi.org/10.1021/jf00062a024
. [all data]
Zenkevich, Eliseenkov, et al., 2006
Zenkevich, I.G.; Eliseenkov, E.V.; Kasatochkin, A.N.,
Application of Retention Indices in GC-MS Identification of Halogenated Organic Compounds,
Mass Spectromery (Rus.), 2006, 3, 2, 131-140. [all data]
Cooke, Hassoun, et al., 2001
Cooke, K.M.; Hassoun, S.; Sanders, S.M.; Pilling, M.J.,
Identification and quantification of volatile organic compounds found in a eucalyptus forest during FIELDVOC'94 in Portugal,
Chemosphere Global Change Science, 2001, 3, 3, 249-257, https://doi.org/10.1016/S1465-9972(01)00008-3
. [all data]
Zenkevich, 2001
Zenkevich, I.G.,
Comparative Characterization of Conditions for Unambuguous Chromatographic Identification of Organic Compounds,
Zh. Anal. Khim., 2001, 56, 9, 915-924. [all data]
Flanagan, Streete, et al., 1997
Flanagan, R.J.; Streete, P.J.; Ramsey, J.D.,
Volatile Substance Abuse, UNODC Technical Series, No 5, United Nations, Office on Drugs and Crime, Vienna International Centre, PO Box 500, A-1400 Vienna, Austria, 1997, 56, retrieved from http://www.odccp.org/pdf/technicalseries1997-01-011.pdf. [all data]
Sorimachi, Tanabe, et al., 1995
Sorimachi, J.; Tanabe, A.; Mitobe, H.; Kuniaki, K.; Masaaki, S.,
Programmed temperature retention indices for volatile organic compounds on headspace GC/MS analysis,
Niigata-ken Eisei Kogai Kenkyusho Nenpo, 1995, 11, 75-79. [all data]
Ciccioli, Cecinato, et al., 1994
Ciccioli, P.; Cecinato, A.; Brancaleoni, E.; Brachetti, A.; Frattoni, M.; Sparapani, R.,
Composition and Distribution of Polar and Non-Polar VOCs in Urban, Rural, Forest and Remote Areas,
Eur Commission EUR, 1994, 549-568. [all data]
Ciccioli, Brancaleoni, et al., 1993
Ciccioli, P.; Brancaleoni, E.; Cecinato, A.; Sparapani, R.; Frattoni, M.,
Identification and determination of biogenic and anthropogenic volatile organic compounds in forest areas of Northern and Southern Europe and a remote site of the Himalaya region by high-resolution gas chromatography-mass spectrometry,
J. Chromatogr., 1993, 643, 1-2, 55-69, https://doi.org/10.1016/0021-9673(93)80541-F
. [all data]
Strete, Ruprah, et al., 1992
Strete, P.J.; Ruprah, M.; Ramsey, J.D.; Flanagan, R.J.,
Detection and identification of volatile substances by headspace capillary gas chromatography to aid the diagnosis of acute poisoning,
Analyst, 1992, 117, 7, 1111-1127, https://doi.org/10.1039/an9921701111
. [all data]
Takeoka, Flath, et al., 1988
Takeoka, G.R.; Flath, R.A.; Güntert, M.; Jennings, W.,
Nectarine volatiles: vacuum steam distillation versus headspace sampling,
J. Agric. Food Chem., 1988, 36, 3, 553-560, https://doi.org/10.1021/jf00081a037
. [all data]
Waggott and Davies, 1984
Waggott, A.; Davies, I.W.,
Identification of organic pollutants using linear temperature programmed retention indices (LTPRIs) - Part II, 1984, retrieved from http://dwi.defra.gov.uk/research/completed-research/reports/dwi0383.pdf. [all data]
Ramsey and Flanagan, 1982
Ramsey, J.D.; Flanagan, R.J.,
Detection and Identification of Volatile Organic Compounds in Blood by Headspace Gas Chromatography as an Aid to the Diagnosis of Solvent Abuse,
J. Chromatogr., 1982, 240, 2, 423-444, https://doi.org/10.1016/S0021-9673(00)99622-5
. [all data]
Heydanek and McGorrin, 1981
Heydanek, M.G.; McGorrin, R.J.,
Gas chromatography-mass spectroscopy investigations on the flavor chemistry of oat groats,
J. Agric. Food Chem., 1981, 29, 5, 950-954, https://doi.org/10.1021/jf00107a016
. [all data]
Shimadzu, 2012
Shimadzu, Pharmaceutical Related,
Analysis of pharmaceutical residual solvent (observation of separation) (1) - GC, 2012, retrieved from www.shimadzu.ru/applications/Applicationspdf/GC/Pharma/Pharmaceutical residual solvents GC.pdf. [all data]
Shimadzu Corporation, 2003
Shimadzu Corporation,
Analysis of pharmaceutical residual solvent (observation of separation), 2003, retrieved from http://www.shimadzu.com.br/analitica/aplicacoes/book/pharm69.pdf. [all data]