1-Pentyne, 4-methyl-
- Formula: C6H10
- Molecular weight: 82.1436
- IUPAC Standard InChIKey: OXRWICUICBZVAE-UHFFFAOYSA-N
- CAS Registry Number: 7154-75-8
- Chemical structure:
View 3d structure (requires JavaScript / HTML 5) - Other names: Isobutylacetylene; Isobutylethyne; 4-Methyl-1-pentyne; (CH3)2CHCH2C≡CH

Gas phase thermochemistry data

Data compiled by: Glushko Thermocenter, Russian Academy of Sciences, Moscow
Constant pressure heat capacity of gas
Cp,gas (J/mol*K) | Temperature (K) | Reference | Comment |
---|---|---|---|
41.63 | 50. | Thermodynamics Research Center, 1997 | p=1 bar. |
58.93 | 100. | ||
76.73 | 150. | ||
93.43 | 200. | ||
118.14 | 273.15 | ||
126.69 | 298.15 | ||
127.32 | 300. | ||
160.07 | 400. | ||
188.35 | 500. | ||
211.88 | 600. | ||
231.61 | 700. | ||
248.41 | 800. | ||
262.85 | 900. | ||
275.34 | 1000. | ||
286.2 | 1100. | ||
295.5 | 1200. | ||
303.7 | 1300. | ||
310.7 | 1400. | ||
316.9 | 1500. |

Phase change data

Data compiled as indicated in comments:
BS - Robert L. Brown and Stephen E. Stein
TRC - Thermodynamics Research Center, NIST Boulder Laboratories, Chris Muzny director
Quantity | Value | Units | Method | Reference | Comment |
---|---|---|---|---|---|
Tboil | 334.4 | K | N/A | Weast and Grasselli, 1989 | BS |
Tboil | 334.32 | K | N/A | Miller, Greenlee, et al., 1954 | Uncertainty assigned by TRC = 0.3 K; TRC |
Tboil | 334.45 | K | N/A | Pomerantz, Fookson, et al., 1954 | Uncertainty assigned by TRC = 0.5 K; TRC |
Tboil | 334.3 | K | N/A | Van Risseghem, 1933 | Uncertainty assigned by TRC = 0.5 K; TRC |
Tboil | 334.9 | K | N/A | Lespieau, 1921 | Uncertainty assigned by TRC = 2. K; TRC |
Quantity | Value | Units | Method | Reference | Comment |
Tfus | 167.85 | K | N/A | Pomerantz, Fookson, et al., 1954 | Uncertainty assigned by TRC = 0.4 K; TRC |

Gas phase ion energetics data

Data compiled as indicated in comments:
LLK - Sharon G. Lias, Rhoda D. Levin, and Sherif A. Kafafi
Ionization energy determinations
IE (eV) | Method | Reference | Comment |
---|---|---|---|
9.83 ± 0.05 | EI | Wolkoff, Holmes, et al., 1980 | LLK |
10.055 ± 0.005 | PE | Carlier, Dubois, et al., 1975 | Vertical value; LLK |
Appearance energy determinations
Ion | AE (eV) | Other Products | Method | Reference | Comment |
---|---|---|---|---|---|
C5H7+ | 10.03 ± 0.05 | CH3 | EI | Wolkoff, Holmes, et al., 1980 | LLK |

Kovats' RI, non-polar column, isothermal

Column type | Active phase | Temperature (C) | I | Reference | Comment |
---|---|---|---|---|---|
Capillary | Squalane | 80. | 550. | Soják, Farkas, et al., 1991 | 107. m/0.25 mm/0.40 μm, H2 |
Packed | Squalane | 27. | 552. | Hively and Hinton, 1968 | He, Chromosorb P; Column length: 15. m; Column diameter: 0.25 mm |
Packed | Squalane | 49. | 552. | Hively and Hinton, 1968 | He, Chromosorb P; Column length: 15. m; Column diameter: 0.25 mm |
Packed | Squalane | 67. | 553. | Hively and Hinton, 1968 | He, Chromosorb P; Column length: 15. m; Column diameter: 0.25 mm |
Packed | Squalane | 86. | 553. | Hively and Hinton, 1968 | He, Chromosorb P; Column length: 15. m; Column diameter: 0.25 mm |

References

Thermodynamics Research Center, 1997
Thermodynamics Research Center,
Selected Values of Properties of Chemical Compounds., Thermodynamics Research Center, Texas A&M University, College Station, Texas, 1997. [all data]
Weast and Grasselli, 1989
CRC Handbook of Data on Organic Compounds, 2nd Editon, Weast,R.C and Grasselli, J.G., ed(s)., CRC Press, Inc., Boca Raton, FL, 1989, 1. [all data]
Miller, Greenlee, et al., 1954
Miller, H.M.; Greenlee, K.W.; Derfer, J.M.; Boord, C.E.,
J. Org. Chem., 1954, 19, 1882. [all data]
Pomerantz, Fookson, et al., 1954
Pomerantz, P.; Fookson, A.; Mears, T.W.; Rothberg, S.; Howard, F.L.,
Synthesis and Physical Properties of Several Acetylenic Hydrocarbons,
J. Res. Natl. Bur. Stand. (U. S.), 1954, 52, 51. [all data]
Van Risseghem, 1933
Van Risseghem, H.,
4-methyl-1-pentene and some of its derivatives.,
Bull. Soc. Chim. Belg., 1933, 42, 229-37. [all data]
Lespieau, 1921
Lespieau, R.,
Bull. Soc. Chim. Fr., 1921, 29, 528. [all data]
Wolkoff, Holmes, et al., 1980
Wolkoff, P.; Holmes, J.L.; Lossing, F.P.,
On the formation of cyclopentenium cations from all C6H10+ molecular ion structures,
Can. J. Chem., 1980, 58, 251. [all data]
Carlier, Dubois, et al., 1975
Carlier, P.; Dubois, J.E.; Masclet, P.; Mouvier, G.,
Spectres de photoelectrons des alcynes,
J. Electron Spectrosc. Relat. Phenom., 1975, 7, 55. [all data]
Soják, Farkas, et al., 1991
Soják, L.; Farkas, P.; Ostrovský, I.; Janák, J.; Chrétien, J.R.,
Capillary gas chromatography of C5 - C13 branched alkynes on squalane and liquid crystal stationary phases,
J. Chromatogr., 1991, 557, 241-253, https://doi.org/10.1016/S0021-9673(01)87136-3
. [all data]
Hively and Hinton, 1968
Hively, R.A.; Hinton, R.E.,
Variation of the retention index with temperature on squalane substrates,
J. Gas Chromatogr., 1968, 6, 4, 203-217, https://doi.org/10.1093/chromsci/6.4.203
. [all data]