1-Methylhexahydroazocin-5-one
- Formula: C8H15NO
- Molecular weight: 141.2108
- IUPAC Standard InChIKey: HXKFJDKQJXBMEY-UHFFFAOYSA-N
- CAS Registry Number: 71512-38-4
- Chemical structure:
View 3d structure (requires JavaScript / HTML 5) - Permanent link for this species. Use this link for bookmarking this species for future reference.

Gas phase ion energetics data

Data compiled by: Sharon G. Lias, John E. Bartmess, Joel F. Liebman, John L. Holmes, Rhoda D. Levin, and W. Gary Mallard
Ionization energy determinations
IE (eV) | Method | Reference | Comment |
---|---|---|---|
8.13 | PE | Spanka, Boese, et al., 1987 | Vertical value |
8.13 | PE | Spanka and Rademacher, 1986 | Vertical value |

References

Spanka, Boese, et al., 1987
Spanka, G.; Boese, R.; Rademacher, P.,
Transannualr interactions in difunctional medium rings. 2. Molecular structure and conformational properties of 1-alkylhexahydroazocin-5-ones,
J. Org. Chem., 1987, 52, 3362. [all data]
Spanka and Rademacher, 1986
Spanka, G.; Rademacher, P.,
Transannular interactions in difunctional medium rings. 1. n/π Interactions in cyclic amino ketones and aminoalkenes studied by photoelectron spectroscopy,
J. Org. Chem., 1986, 51, 592. [all data]