2-Hexene, 2,3-dimethyl-
- Formula: C8H16
- Molecular weight: 112.2126
- IUPAC Standard InChIKey: RGYAVZGBAJFMIZ-UHFFFAOYSA-N
- CAS Registry Number: 7145-20-2
- Chemical structure:
View 3d structure (requires JavaScript / HTML 5) - Other names: 2,3-Dimethyl-2-hexene; C2H5CH2C(CH3)=C(CH3)2; 2,3-Dimethylhex-2-ene

Phase change data

Data compiled as indicated in comments:
TRC - Thermodynamics Research Center, NIST Boulder Laboratories, Chris Muzny director
AC - William E. Acree, Jr., James S. Chickos
Quantity | Value | Units | Method | Reference | Comment |
---|---|---|---|---|---|
Tboil | 395.01 | K | N/A | Anonymous, 1953 | Uncertainty assigned by TRC = 0.07 K; TRC |
Tboil | 395.01 | K | N/A | Anonymous, 1953 | Uncertainty assigned by TRC = 0.3 K; TRC |
Tboil | 394.92 | K | N/A | Anonymous, 1953 | Uncertainty assigned by TRC = 0.4 K; TRC |
Tboil | 395. | K | N/A | Boord, Greenlee, et al., 1946 | Uncertainty assigned by TRC = 0.4 K; TRC |
Tboil | 395. | K | N/A | Boord, Greenlee, et al., 1945 | Uncertainty assigned by TRC = 0.4 K; TRC |
Quantity | Value | Units | Method | Reference | Comment |
Tfus | 158.08 | K | N/A | Streiff, Hulme, et al., 1955 | Uncertainty assigned by TRC = 0.06 K; TRC |
Tfus | 158.09 | K | N/A | Streiff, Hulme, et al., 1955 | Uncertainty assigned by TRC = 0.04 K; TRC |
Tfus | 158.15 | K | N/A | Streiff, Hulme, et al., 1955 | Uncertainty assigned by TRC = 0.03 K; TRC |
Tfus | 155.0 | K | N/A | Cline, 1939 | Uncertainty assigned by TRC = 0.8 K; TRC |
Quantity | Value | Units | Method | Reference | Comment |
ΔvapH° | 39.7 | kJ/mol | N/A | Reid, 1972 | AC |

Gas phase ion energetics data

Data compiled as indicated in comments:
LLK - Sharon G. Lias, Rhoda D. Levin, and Sherif A. Kafafi
Ionization energy determinations
IE (eV) | Method | Reference | Comment |
---|---|---|---|
8.186 ± 0.005 | PE | Masclet, Grosjean, et al., 1973 | LLK |

Normal alkane RI, non-polar column, temperature ramp

Data compiled by: NIST Mass Spectrometry Data Center, William E. Wallace, director

Column type CapillaryCapillaryCapillary
Active phase Petrocol DHPetrocol DHOV-101
Column length (m) 150.150.50.
Carrier gas   Helium
Substrate
Column diameter (mm) 0.250.250.20
Phase thickness (μm) 1.01.00.50
Tstart (C) 40.40.30.
Tend (C) 300.300.100.
Heat rate (K/min) 1.1.1.
Initial hold (min)   6.
Final hold (min)
I 800.800.796.
ReferenceSojak, Kubinec, et al., 2006Sojak, Kubinec, et al., 2006Orav, Kailas, et al., 1999
Comment MSDC-RI MSDC-RI MSDC-RI

Normal alkane RI, non-polar column, custom temperature program

Data compiled by: NIST Mass Spectrometry Data Center, William E. Wallace, director

Column type Capillary
Active phase Polydimethyl siloxane
Column length (m)
Carrier gas
Substrate
Column diameter (mm)
Phase thickness (μm)
Program not specified
I 790.
ReferenceJunkes, Castanho, et al., 2003
Comment MSDC-RI

Kovats' RI, non-polar column, isothermal

View large format table.

Column type Active phase Temperature (C) I Reference Comment
CapillaryPetrocol DH30.800.2Soják, Addová, et al., 2004150. m/0.25 mm/1. μm, H2
CapillarySqualane30.787.4Soják, Addová, et al., 2004He; Column length: 93. m; Column diameter: 0.25 mm
CapillaryOV-10140.795.Laub and Purnell, 1988
CapillaryOV-10160.796.Laub and Purnell, 1988
CapillaryOV-10180.797.Laub and Purnell, 1988
CapillaryOV-10150.795.2Boneva and Dimov, 1986100. m/0.27 mm/0.9 μm, N2
CapillaryOV-10170.796.2Boneva and Dimov, 1986100. m/0.27 mm/0.9 μm, N2
CapillarySqualane50.789.Boneva and Dimov, 1986N2; Column length: 100. m; Column diameter: 0.25 mm
CapillarySqualane70.790.Boneva and Dimov, 1986N2; Column length: 100. m; Column diameter: 0.25 mm
CapillarySqualane50.789.Chretien and Dubois, 1976
CapillarySqualane50.789.Rijks and Cramers, 1974N2; Column length: 100. m; Column diameter: 0.25 mm
CapillarySqualane70.790.Rijks and Cramers, 1974N2; Column length: 100. m; Column diameter: 0.25 mm
CapillarySqualane40.789.Matukuma, 1969N2; Column length: 91.4 m; Column diameter: 0.25 mm
PackedSqualane30.740.Tourres, 1967H2; Column length: 10. m
PackedSqualane30.787.5Tourres, 1967H2; Column length: 10. m
PackedSqualane50.741.Tourres, 1967H2; Column length: 10. m
PackedSqualane50.788.5Tourres, 1967H2; Column length: 10. m

Van Den Dool and Kratz RI, non-polar column, temperature ramp

View large format table.

Column type Active phase I Reference Comment
CapillarySPB-1814.Huang, Bruechert, et al., 198760. m/0.25 mm/0.25 μm, He, 35. C @ 10. min, 2. K/min, 235. C @ 40. min

References

Anonymous, 1953
Anonymous, R.,
, Physical Properties of Chemical Substances, Dow Chemical Company, 1953. [all data]
Boord, Greenlee, et al., 1946
Boord, C.E.; Greenlee, K.W.; Perilstein, W.L.,
The Synthesis, Purification and Prop. of Hydrocarbons of Low Mol. Weight, Am. Pet. Inst. Res. Proj. 45, Eighth Annu. Rep., Ohio State Univ., June 30, 1946. [all data]
Boord, Greenlee, et al., 1945
Boord, C.E.; Greenlee, K.W.; Perilstein, W.L.,
, Am. Pet. Inst. Res. Proj. 45, Seventh Annu. Rep., Ohio State Univ., June 30, 1945. [all data]
Streiff, Hulme, et al., 1955
Streiff, A.J.; Hulme, A.R.; Cowie, P.A.; Krouskop, N.C.; Rossini, F.D.,
Purification, Purity, and Freezing Points of Sixty-four American Petroleum Institute Standard and Research Hydrocarbons,
Anal. Chem., 1955, 27, 411. [all data]
Cline, 1939
Cline, E.T.,
The Synthesis of Type III and Type V Olefins from Dimethylbutadien- monohydrobromide, Ph.D. Dissertation, Ohio State Univ., Columbus, OH, 1939. [all data]
Reid, 1972
Reid, Robert C.,
Handbook on vapor pressure and heats of vaporization of hydrocarbons and related compounds, R. C. Wilhort and B. J. Zwolinski, Texas A Research Foundation. College Station, Texas(1971). 329 pages.$10.00,
AIChE J., 1972, 18, 6, 1278-1278, https://doi.org/10.1002/aic.690180637
. [all data]
Masclet, Grosjean, et al., 1973
Masclet, P.; Grosjean, D.; Mouvier, G.,
Alkene ionization potentials. Part I. Quantitative determination of alkyl group structural effects,
J. Electron Spectrosc. Relat. Phenom., 1973, 2, 225. [all data]